kafka-dev mailing list archives

Site index · List index
Message view « Date » · « Thread »
Top « Date » · « Thread »
From Apache Jenkins Server <jenk...@builds.apache.org>
Subject Build failed in Jenkins: kafka-trunk-jdk8 #2614
Date Thu, 03 May 2018 01:36:04 GMT
See <https://builds.apache.org/job/kafka-trunk-jdk8/2614/display/redirect?page=changes>

Changes:

[wangguoz] KAFKA-6657: Add StreamsConfig prefix for different consumers (#4805)

[wangguoz] HOTFIX: Simplify ConsoleConsumer stripWithPrefix function

------------------------------------------
[...truncated 422.47 KB...]

kafka.api.SaslClientsWithInvalidCredentialsTest > testConsumerGroupServiceWithAuthenticationFailure
STARTED

kafka.api.SaslClientsWithInvalidCredentialsTest > testConsumerGroupServiceWithAuthenticationFailure
PASSED

kafka.api.SaslClientsWithInvalidCredentialsTest > testManualAssignmentConsumerWithAutoCommitDisabledWithAuthenticationFailure
STARTED

kafka.api.SaslClientsWithInvalidCredentialsTest > testManualAssignmentConsumerWithAutoCommitDisabledWithAuthenticationFailure
PASSED

kafka.api.SaslClientsWithInvalidCredentialsTest > testKafkaAdminClientWithAuthenticationFailure
STARTED

kafka.api.SaslClientsWithInvalidCredentialsTest > testKafkaAdminClientWithAuthenticationFailure
PASSED

kafka.api.SaslClientsWithInvalidCredentialsTest > testConsumerWithAuthenticationFailure
STARTED

kafka.api.SaslClientsWithInvalidCredentialsTest > testConsumerWithAuthenticationFailure
PASSED

kafka.api.DelegationTokenEndToEndAuthorizationTest > testNoConsumeWithoutDescribeAclViaSubscribe
STARTED

kafka.api.DelegationTokenEndToEndAuthorizationTest > testNoConsumeWithoutDescribeAclViaSubscribe
PASSED

kafka.api.DelegationTokenEndToEndAuthorizationTest > testProduceConsumeViaAssign STARTED

kafka.api.DelegationTokenEndToEndAuthorizationTest > testProduceConsumeViaAssign PASSED

kafka.api.DelegationTokenEndToEndAuthorizationTest > testNoConsumeWithDescribeAclViaAssign
STARTED

kafka.api.DelegationTokenEndToEndAuthorizationTest > testNoConsumeWithDescribeAclViaAssign
PASSED

kafka.api.DelegationTokenEndToEndAuthorizationTest > testNoConsumeWithDescribeAclViaSubscribe
STARTED

kafka.api.DelegationTokenEndToEndAuthorizationTest > testNoConsumeWithDescribeAclViaSubscribe
PASSED

kafka.api.DelegationTokenEndToEndAuthorizationTest > testNoConsumeWithoutDescribeAclViaAssign
STARTED

kafka.api.DelegationTokenEndToEndAuthorizationTest > testNoConsumeWithoutDescribeAclViaAssign
PASSED

kafka.api.DelegationTokenEndToEndAuthorizationTest > testNoGroupAcl STARTED

kafka.api.DelegationTokenEndToEndAuthorizationTest > testNoGroupAcl PASSED

kafka.api.DelegationTokenEndToEndAuthorizationTest > testNoProduceWithDescribeAcl STARTED

kafka.api.DelegationTokenEndToEndAuthorizationTest > testNoProduceWithDescribeAcl PASSED

kafka.api.DelegationTokenEndToEndAuthorizationTest > testProduceConsumeViaSubscribe STARTED

kafka.api.DelegationTokenEndToEndAuthorizationTest > testProduceConsumeViaSubscribe PASSED

kafka.api.DelegationTokenEndToEndAuthorizationTest > testNoProduceWithoutDescribeAcl STARTED

kafka.api.DelegationTokenEndToEndAuthorizationTest > testNoProduceWithoutDescribeAcl PASSED

kafka.api.SaslGssapiSslEndToEndAuthorizationTest > testTwoConsumersWithDifferentSaslCredentials
STARTED

kafka.api.SaslGssapiSslEndToEndAuthorizationTest > testTwoConsumersWithDifferentSaslCredentials
PASSED

kafka.api.SaslGssapiSslEndToEndAuthorizationTest > testNoConsumeWithoutDescribeAclViaSubscribe
STARTED

kafka.api.SaslGssapiSslEndToEndAuthorizationTest > testNoConsumeWithoutDescribeAclViaSubscribe
PASSED

kafka.api.SaslGssapiSslEndToEndAuthorizationTest > testProduceConsumeViaAssign STARTED

kafka.api.SaslGssapiSslEndToEndAuthorizationTest > testProduceConsumeViaAssign PASSED

kafka.api.SaslGssapiSslEndToEndAuthorizationTest > testNoConsumeWithDescribeAclViaAssign
STARTED

kafka.api.SaslGssapiSslEndToEndAuthorizationTest > testNoConsumeWithDescribeAclViaAssign
PASSED

kafka.api.SaslGssapiSslEndToEndAuthorizationTest > testNoConsumeWithDescribeAclViaSubscribe
STARTED

kafka.api.SaslGssapiSslEndToEndAuthorizationTest > testNoConsumeWithDescribeAclViaSubscribe
PASSED

kafka.api.SaslGssapiSslEndToEndAuthorizationTest > testNoConsumeWithoutDescribeAclViaAssign
STARTED

kafka.api.SaslGssapiSslEndToEndAuthorizationTest > testNoConsumeWithoutDescribeAclViaAssign
PASSED

kafka.api.SaslGssapiSslEndToEndAuthorizationTest > testNoGroupAcl STARTED

kafka.api.SaslGssapiSslEndToEndAuthorizationTest > testNoGroupAcl PASSED

kafka.api.SaslGssapiSslEndToEndAuthorizationTest > testNoProduceWithDescribeAcl STARTED

kafka.api.SaslGssapiSslEndToEndAuthorizationTest > testNoProduceWithDescribeAcl PASSED

kafka.api.SaslGssapiSslEndToEndAuthorizationTest > testProduceConsumeViaSubscribe STARTED

kafka.api.SaslGssapiSslEndToEndAuthorizationTest > testProduceConsumeViaSubscribe PASSED

kafka.api.SaslGssapiSslEndToEndAuthorizationTest > testNoProduceWithoutDescribeAcl STARTED

kafka.api.SaslGssapiSslEndToEndAuthorizationTest > testNoProduceWithoutDescribeAcl PASSED

kafka.api.TransactionsTest > testBasicTransactions STARTED

kafka.api.TransactionsTest > testBasicTransactions PASSED

kafka.api.TransactionsTest > testFencingOnSendOffsets STARTED

kafka.api.TransactionsTest > testFencingOnSendOffsets PASSED

kafka.api.TransactionsTest > testFencingOnAddPartitions STARTED

kafka.api.TransactionsTest > testFencingOnAddPartitions PASSED

kafka.api.TransactionsTest > testFencingOnTransactionExpiration STARTED

kafka.api.TransactionsTest > testFencingOnTransactionExpiration PASSED

kafka.api.TransactionsTest > testDelayedFetchIncludesAbortedTransaction STARTED

kafka.api.TransactionsTest > testDelayedFetchIncludesAbortedTransaction PASSED

kafka.api.TransactionsTest > testConsecutivelyRunInitTransactions STARTED

kafka.api.TransactionsTest > testConsecutivelyRunInitTransactions PASSED

kafka.api.TransactionsTest > testReadCommittedConsumerShouldNotSeeUndecidedData STARTED

kafka.api.TransactionsTest > testReadCommittedConsumerShouldNotSeeUndecidedData PASSED

kafka.api.TransactionsTest > testFencingOnSend STARTED

kafka.api.TransactionsTest > testFencingOnSend PASSED

kafka.api.TransactionsTest > testFencingOnCommit STARTED

kafka.api.TransactionsTest > testFencingOnCommit PASSED

kafka.api.TransactionsTest > testMultipleMarkersOneLeader STARTED

kafka.api.TransactionsTest > testMultipleMarkersOneLeader PASSED

kafka.api.TransactionsTest > testSendOffsets STARTED

kafka.api.TransactionsTest > testSendOffsets PASSED

kafka.api.PlaintextEndToEndAuthorizationTest > testNoConsumeWithoutDescribeAclViaSubscribe
STARTED

kafka.api.PlaintextEndToEndAuthorizationTest > testNoConsumeWithoutDescribeAclViaSubscribe
PASSED

kafka.api.PlaintextEndToEndAuthorizationTest > testProduceConsumeViaAssign STARTED

kafka.api.PlaintextEndToEndAuthorizationTest > testProduceConsumeViaAssign PASSED

kafka.api.PlaintextEndToEndAuthorizationTest > testNoConsumeWithDescribeAclViaAssign STARTED

kafka.api.PlaintextEndToEndAuthorizationTest > testNoConsumeWithDescribeAclViaAssign PASSED

kafka.api.PlaintextEndToEndAuthorizationTest > testNoConsumeWithDescribeAclViaSubscribe
STARTED

kafka.api.PlaintextEndToEndAuthorizationTest > testNoConsumeWithDescribeAclViaSubscribe
PASSED

kafka.api.PlaintextEndToEndAuthorizationTest > testNoConsumeWithoutDescribeAclViaAssign
STARTED

kafka.api.PlaintextEndToEndAuthorizationTest > testNoConsumeWithoutDescribeAclViaAssign
PASSED

kafka.api.PlaintextEndToEndAuthorizationTest > testNoGroupAcl STARTED

kafka.api.PlaintextEndToEndAuthorizationTest > testNoGroupAcl PASSED

kafka.api.PlaintextEndToEndAuthorizationTest > testNoProduceWithDescribeAcl STARTED

kafka.api.PlaintextEndToEndAuthorizationTest > testNoProduceWithDescribeAcl PASSED

kafka.api.PlaintextEndToEndAuthorizationTest > testProduceConsumeViaSubscribe STARTED

kafka.api.PlaintextEndToEndAuthorizationTest > testProduceConsumeViaSubscribe PASSED

kafka.api.PlaintextEndToEndAuthorizationTest > testNoProduceWithoutDescribeAcl STARTED

kafka.api.PlaintextEndToEndAuthorizationTest > testNoProduceWithoutDescribeAcl PASSED

unit.kafka.admin.DeleteConsumerGroupTest > testDeleteNonEmptyGroup STARTED

unit.kafka.admin.DeleteConsumerGroupTest > testDeleteNonEmptyGroup PASSED

unit.kafka.admin.DeleteConsumerGroupTest > testDeleteCmdWithMixOfSuccessAndError STARTED

unit.kafka.admin.DeleteConsumerGroupTest > testDeleteCmdWithMixOfSuccessAndError PASSED

unit.kafka.admin.DeleteConsumerGroupTest > testDeleteWithShortInitialization STARTED

unit.kafka.admin.DeleteConsumerGroupTest > testDeleteWithShortInitialization PASSED

unit.kafka.admin.DeleteConsumerGroupTest > testDeleteCmdWithShortInitialization STARTED

unit.kafka.admin.DeleteConsumerGroupTest > testDeleteCmdWithShortInitialization PASSED

unit.kafka.admin.DeleteConsumerGroupTest > testDeleteWithTopicOption STARTED

unit.kafka.admin.DeleteConsumerGroupTest > testDeleteWithTopicOption PASSED

unit.kafka.admin.DeleteConsumerGroupTest > testDeleteNonExistingGroup STARTED

unit.kafka.admin.DeleteConsumerGroupTest > testDeleteNonExistingGroup PASSED

unit.kafka.admin.DeleteConsumerGroupTest > testDeleteCmdNonEmptyGroup STARTED

unit.kafka.admin.DeleteConsumerGroupTest > testDeleteCmdNonEmptyGroup PASSED

unit.kafka.admin.DeleteConsumerGroupTest > testDeleteCmdNonExistingGroup STARTED

unit.kafka.admin.DeleteConsumerGroupTest > testDeleteCmdNonExistingGroup PASSED

unit.kafka.admin.DeleteConsumerGroupTest > testDeleteEmptyGroup STARTED

unit.kafka.admin.DeleteConsumerGroupTest > testDeleteEmptyGroup PASSED

unit.kafka.admin.DeleteConsumerGroupTest > testDeleteWithMixOfSuccessAndError STARTED

unit.kafka.admin.DeleteConsumerGroupTest > testDeleteWithMixOfSuccessAndError PASSED

unit.kafka.admin.DeleteConsumerGroupTest > testDeleteCmdEmptyGroup STARTED

unit.kafka.admin.DeleteConsumerGroupTest > testDeleteCmdEmptyGroup PASSED

1936 tests completed, 1 failed, 5 skipped
:kafka-trunk-jdk8:core:test FAILED
:test_core_2_11 FAILED

FAILURE: Build failed with an exception.

* What went wrong:
Execution failed for task ':kafka-trunk-jdk8:core:test'.
> There were failing tests. See the report at: file://<https://builds.apache.org/job/kafka-trunk-jdk8/ws/core/build/reports/tests/test/index.html>

* Try:
Run with --stacktrace option to get the stack trace. Run with --info or --debug option to
get more log output. Run with --scan to get full insights.

* Get more help at https://help.gradle.org

BUILD FAILED in 1h 41m 1s
24 actionable tasks: 2 executed, 22 up-to-date
Build step 'Execute shell' marked build as failure
[FINDBUGS] Collecting findbugs analysis files...
Setting GRADLE_4_4_HOME=/home/jenkins/tools/gradle/4.4
[FINDBUGS] Searching for all files in <https://builds.apache.org/job/kafka-trunk-jdk8/ws/>
that match the pattern **/build/reports/findbugs/*.xml
[FINDBUGS] Parsing 1 file in <https://builds.apache.org/job/kafka-trunk-jdk8/ws/>
[FINDBUGS] Successfully parsed file <https://builds.apache.org/job/kafka-trunk-jdk8/ws/core/build/reports/findbugs/main.xml>
with 0 unique warnings and 0 duplicates.
Setting GRADLE_4_4_HOME=/home/jenkins/tools/gradle/4.4
Setting GRADLE_4_4_HOME=/home/jenkins/tools/gradle/4.4
<Git Blamer> Using GitBlamer to create author and commit information for all warnings.
<Git Blamer> GIT_COMMIT=a7746dd5b4d1eb529433b33be65aa2decd99a737, workspace=<https://builds.apache.org/job/kafka-trunk-jdk8/ws/>
[FINDBUGS] Computing warning deltas based on reference build #2613
Recording test results
Setting GRADLE_4_4_HOME=/home/jenkins/tools/gradle/4.4
Setting GRADLE_4_4_HOME=/home/jenkins/tools/gradle/4.4
Not sending mail to unregistered user wangguoz@gmail.com

Mime
View raw message