kafka-dev mailing list archives

Site index · List index
Message view « Date » · « Thread »
Top « Date » · « Thread »
From Apache Jenkins Server <jenk...@builds.apache.org>
Subject Build failed in Jenkins: kafka-trunk-jdk7 #3365
Date Mon, 23 Apr 2018 20:39:49 GMT
See <https://builds.apache.org/job/kafka-trunk-jdk7/3365/display/redirect?page=changes>

Changes:

[wangguoz] KAFKA-6376; refactor skip metrics in Kafka Streams

[jason] MINOR: Fix formatting in --new-consumer deprecation warning (#4903)

------------------------------------------
[...truncated 412.74 KB...]
	at hudson.scm.SCM.poll(SCM.java:408)
	at hudson.model.AbstractProject._poll(AbstractProject.java:1384)
	at hudson.model.AbstractProject.poll(AbstractProject.java:1287)
	at hudson.triggers.SCMTrigger$Runner.runPolling(SCMTrigger.java:594)
	at hudson.triggers.SCMTrigger$Runner.run(SCMTrigger.java:640)
	at hudson.util.SequentialExecutionQueue$QueueEntry.run(SequentialExecutionQueue.java:119)
	at java.util.concurrent.Executors$RunnableAdapter.call(Executors.java:511)
	at java.util.concurrent.FutureTask.run(FutureTask.java:266)
	at java.util.concurrent.ThreadPoolExecutor.runWorker(ThreadPoolExecutor.java:1149)
	at java.util.concurrent.ThreadPoolExecutor$Worker.run(ThreadPoolExecutor.java:624)
	at java.lang.Thread.run(Thread.java:748)

kafka.admin.ResetConsumerGroupOffsetTest > testResetOffsetsShiftByLowerThanEarliest PASSED

kafka.admin.ResetConsumerGroupOffsetTest > testResetOffsetsByDuration STARTED

kafka.admin.ResetConsumerGroupOffsetTest > testResetOffsetsByDuration PASSED

kafka.admin.ResetConsumerGroupOffsetTest > testResetOffsetsToLocalDateTime STARTED

kafka.admin.ResetConsumerGroupOffsetTest > testResetOffsetsToLocalDateTime PASSED

kafka.admin.ResetConsumerGroupOffsetTest > testResetOffsetsToEarliestOnTopicsAndPartitions
STARTED

kafka.admin.ResetConsumerGroupOffsetTest > testResetOffsetsToEarliestOnTopicsAndPartitions
PASSED

kafka.admin.ResetConsumerGroupOffsetTest > testResetOffsetsToEarliestOnTopics STARTED

kafka.admin.ResetConsumerGroupOffsetTest > testResetOffsetsToEarliestOnTopics PASSED

kafka.admin.ReassignPartitionsCommandArgsTest > shouldFailIfBlankArg STARTED

kafka.admin.ReassignPartitionsCommandArgsTest > shouldFailIfBlankArg PASSED

kafka.admin.ReassignPartitionsCommandArgsTest > shouldNotAllowVerifyWithoutReassignmentOption
STARTED

kafka.admin.ReassignPartitionsCommandArgsTest > shouldNotAllowVerifyWithoutReassignmentOption
PASSED

kafka.admin.ReassignPartitionsCommandArgsTest > shouldNotAllowGenerateWithoutBrokersOption
STARTED

kafka.admin.ReassignPartitionsCommandArgsTest > shouldNotAllowGenerateWithoutBrokersOption
PASSED

kafka.admin.ReassignPartitionsCommandArgsTest > shouldNotAllowTopicsOptionWithVerify STARTED

kafka.admin.ReassignPartitionsCommandArgsTest > shouldNotAllowTopicsOptionWithVerify PASSED

kafka.admin.ReassignPartitionsCommandArgsTest > shouldNotAllowGenerateWithThrottleOption
STARTED

kafka.admin.ReassignPartitionsCommandArgsTest > shouldNotAllowGenerateWithThrottleOption
PASSED

kafka.admin.ReassignPartitionsCommandArgsTest > shouldFailIfNoArgs STARTED

kafka.admin.ReassignPartitionsCommandArgsTest > shouldFailIfNoArgs PASSED

kafka.admin.ReassignPartitionsCommandArgsTest > shouldNotAllowExecuteWithoutReassignmentOption
STARTED

kafka.admin.ReassignPartitionsCommandArgsTest > shouldNotAllowExecuteWithoutReassignmentOption
PASSED

kafka.admin.ReassignPartitionsCommandArgsTest > shouldNotAllowBrokersListWithVerifyOption
STARTED

kafka.admin.ReassignPartitionsCommandArgsTest > shouldNotAllowBrokersListWithVerifyOption
PASSED

kafka.admin.ReassignPartitionsCommandArgsTest > shouldCorrectlyParseValidMinimumExecuteOptions
STARTED

kafka.admin.ReassignPartitionsCommandArgsTest > shouldCorrectlyParseValidMinimumExecuteOptions
PASSED

kafka.admin.ReassignPartitionsCommandArgsTest > shouldNotAllowGenerateWithReassignmentOption
STARTED

kafka.admin.ReassignPartitionsCommandArgsTest > shouldNotAllowGenerateWithReassignmentOption
PASSED

kafka.admin.ReassignPartitionsCommandArgsTest > shouldCorrectlyParseValidMinimumGenerateOptions
STARTED

kafka.admin.ReassignPartitionsCommandArgsTest > shouldCorrectlyParseValidMinimumGenerateOptions
PASSED

kafka.admin.ReassignPartitionsCommandArgsTest > shouldNotAllowGenerateWithoutBrokersAndTopicsOptions
STARTED

kafka.admin.ReassignPartitionsCommandArgsTest > shouldNotAllowGenerateWithoutBrokersAndTopicsOptions
PASSED

kafka.admin.ReassignPartitionsCommandArgsTest > shouldNotAllowThrottleWithVerifyOption
STARTED

kafka.admin.ReassignPartitionsCommandArgsTest > shouldNotAllowThrottleWithVerifyOption
PASSED

kafka.admin.ReassignPartitionsCommandArgsTest > shouldUseDefaultsIfEnabled STARTED

kafka.admin.ReassignPartitionsCommandArgsTest > shouldUseDefaultsIfEnabled PASSED

kafka.admin.ReassignPartitionsCommandArgsTest > shouldAllowThrottleOptionOnExecute STARTED

kafka.admin.ReassignPartitionsCommandArgsTest > shouldAllowThrottleOptionOnExecute PASSED

kafka.admin.ReassignPartitionsCommandArgsTest > shouldNotAllowExecuteWithBrokers STARTED

kafka.admin.ReassignPartitionsCommandArgsTest > shouldNotAllowExecuteWithBrokers PASSED

kafka.admin.ReassignPartitionsCommandArgsTest > shouldNotAllowExecuteWithTopicsOption STARTED

kafka.admin.ReassignPartitionsCommandArgsTest > shouldNotAllowExecuteWithTopicsOption PASSED

kafka.admin.ReassignPartitionsCommandArgsTest > shouldCorrectlyParseValidMinimumVerifyOptions
STARTED

kafka.admin.ReassignPartitionsCommandArgsTest > shouldCorrectlyParseValidMinimumVerifyOptions
PASSED

kafka.admin.ReassignPartitionsCommandArgsTest > shouldNotAllowGenerateWithoutTopicsOption
STARTED

kafka.admin.ReassignPartitionsCommandArgsTest > shouldNotAllowGenerateWithoutTopicsOption
PASSED

kafka.admin.BrokerApiVersionsCommandTest > checkBrokerApiVersionCommandOutput STARTED

kafka.admin.BrokerApiVersionsCommandTest > checkBrokerApiVersionCommandOutput PASSED

kafka.admin.TopicCommandTest > testCreateIfNotExists STARTED

kafka.admin.TopicCommandTest > testCreateIfNotExists PASSED

kafka.admin.TopicCommandTest > testCreateAlterTopicWithRackAware STARTED

kafka.admin.TopicCommandTest > testCreateAlterTopicWithRackAware PASSED

kafka.admin.TopicCommandTest > testTopicDeletion STARTED

kafka.admin.TopicCommandTest > testTopicDeletion PASSED

kafka.admin.TopicCommandTest > testConfigPreservationAcrossPartitionAlteration STARTED

kafka.admin.TopicCommandTest > testConfigPreservationAcrossPartitionAlteration PASSED

kafka.admin.TopicCommandTest > testAlterIfExists STARTED

kafka.admin.TopicCommandTest > testAlterIfExists PASSED

kafka.admin.TopicCommandTest > testDescribeAndListTopicsMarkedForDeletion STARTED

kafka.admin.TopicCommandTest > testDescribeAndListTopicsMarkedForDeletion PASSED

kafka.admin.TopicCommandTest > testDeleteIfExists STARTED

kafka.admin.TopicCommandTest > testDeleteIfExists PASSED

kafka.admin.AdminZkClientTest > testGetBrokerMetadatas STARTED

kafka.admin.AdminZkClientTest > testGetBrokerMetadatas PASSED

kafka.admin.AdminZkClientTest > testBootstrapClientIdConfig STARTED

kafka.admin.AdminZkClientTest > testBootstrapClientIdConfig PASSED

kafka.admin.AdminZkClientTest > testTopicConfigChange STARTED

kafka.admin.AdminZkClientTest > testTopicConfigChange PASSED

kafka.admin.AdminZkClientTest > testManualReplicaAssignment STARTED

kafka.admin.AdminZkClientTest > testManualReplicaAssignment PASSED

kafka.admin.AdminZkClientTest > testConcurrentTopicCreation STARTED

kafka.admin.AdminZkClientTest > testConcurrentTopicCreation PASSED

kafka.admin.AdminZkClientTest > shouldPropagateDynamicBrokerConfigs STARTED

kafka.admin.AdminZkClientTest > shouldPropagateDynamicBrokerConfigs PASSED

kafka.admin.AdminZkClientTest > testTopicCreationWithCollision STARTED

kafka.admin.AdminZkClientTest > testTopicCreationWithCollision PASSED

kafka.admin.AdminZkClientTest > testTopicCreationInZK STARTED

kafka.admin.AdminZkClientTest > testTopicCreationInZK PASSED

unit.kafka.admin.DeleteConsumerGroupTest > testDeleteNonEmptyGroup STARTED

unit.kafka.admin.DeleteConsumerGroupTest > testDeleteNonEmptyGroup PASSED

unit.kafka.admin.DeleteConsumerGroupTest > testDeleteCmdWithMixOfSuccessAndError STARTED

unit.kafka.admin.DeleteConsumerGroupTest > testDeleteCmdWithMixOfSuccessAndError PASSED

unit.kafka.admin.DeleteConsumerGroupTest > testDeleteWithShortInitialization STARTED

unit.kafka.admin.DeleteConsumerGroupTest > testDeleteWithShortInitialization PASSED

unit.kafka.admin.DeleteConsumerGroupTest > testDeleteCmdWithShortInitialization STARTED

unit.kafka.admin.DeleteConsumerGroupTest > testDeleteCmdWithShortInitialization PASSED

unit.kafka.admin.DeleteConsumerGroupTest > testDeleteWithTopicOption STARTED

unit.kafka.admin.DeleteConsumerGroupTest > testDeleteWithTopicOption PASSED

unit.kafka.admin.DeleteConsumerGroupTest > testDeleteNonExistingGroup STARTED

unit.kafka.admin.DeleteConsumerGroupTest > testDeleteNonExistingGroup PASSED

unit.kafka.admin.DeleteConsumerGroupTest > testDeleteCmdNonEmptyGroup STARTED

unit.kafka.admin.DeleteConsumerGroupTest > testDeleteCmdNonEmptyGroup PASSED

unit.kafka.admin.DeleteConsumerGroupTest > testDeleteCmdNonExistingGroup STARTED

unit.kafka.admin.DeleteConsumerGroupTest > testDeleteCmdNonExistingGroup PASSED

unit.kafka.admin.DeleteConsumerGroupTest > testDeleteEmptyGroup STARTED

unit.kafka.admin.DeleteConsumerGroupTest > testDeleteEmptyGroup PASSED

unit.kafka.admin.DeleteConsumerGroupTest > testDeleteWithMixOfSuccessAndError STARTED

unit.kafka.admin.DeleteConsumerGroupTest > testDeleteWithMixOfSuccessAndError PASSED

unit.kafka.admin.DeleteConsumerGroupTest > testDeleteCmdEmptyGroup STARTED

unit.kafka.admin.DeleteConsumerGroupTest > testDeleteCmdEmptyGroup PASSED

1918 tests completed, 1 failed, 4 skipped
:kafka-trunk-jdk7:core:test FAILED
:test_core_2_11 FAILED

FAILURE: Build failed with an exception.

* What went wrong:
Execution failed for task ':kafka-trunk-jdk7:core:test'.
> There were failing tests. See the report at: file://<https://builds.apache.org/job/kafka-trunk-jdk7/ws/core/build/reports/tests/test/index.html>

* Try:
Run with --stacktrace option to get the stack trace. Run with --info or --debug option to
get more log output. Run with --scan to get full insights.

* Get more help at https://help.gradle.org

Deprecated Gradle features were used in this build, making it incompatible with Gradle 5.0.
See https://docs.gradle.org/4.5.1/userguide/command_line_interface.html#sec:command_line_warnings

BUILD FAILED in 1h 1m 7s
23 actionable tasks: 3 executed, 20 up-to-date
Build step 'Execute shell' marked build as failure
[FINDBUGS] Collecting findbugs analysis files...
Setting GRADLE_3_5_HOME=/home/jenkins/tools/gradle/3.5
[FINDBUGS] Searching for all files in <https://builds.apache.org/job/kafka-trunk-jdk7/ws/>
that match the pattern **/build/reports/findbugs/*.xml
[FINDBUGS] Parsing 1 file in <https://builds.apache.org/job/kafka-trunk-jdk7/ws/>
[FINDBUGS] Successfully parsed file <https://builds.apache.org/job/kafka-trunk-jdk7/ws/core/build/reports/findbugs/main.xml>
with 0 unique warnings and 0 duplicates.
Setting GRADLE_3_5_HOME=/home/jenkins/tools/gradle/3.5
Setting GRADLE_3_5_HOME=/home/jenkins/tools/gradle/3.5
<Git Blamer> Using GitBlamer to create author and commit information for all warnings.
<Git Blamer> GIT_COMMIT=35c75ea5036fbffe6ac74fe4f76a633bda061fec, workspace=<https://builds.apache.org/job/kafka-trunk-jdk7/ws/>
[FINDBUGS] Computing warning deltas based on reference build #3364
Recording test results
Setting GRADLE_3_5_HOME=/home/jenkins/tools/gradle/3.5
Setting GRADLE_3_5_HOME=/home/jenkins/tools/gradle/3.5
Not sending mail to unregistered user wangguoz@gmail.com

Mime
View raw message