kafka-dev mailing list archives

Site index · List index
Message view « Date » · « Thread »
Top « Date » · « Thread »
From Apache Jenkins Server <jenk...@builds.apache.org>
Subject Build failed in Jenkins: kafka-trunk-jdk8 #2523
Date Tue, 03 Apr 2018 22:38:01 GMT
See <https://builds.apache.org/job/kafka-trunk-jdk8/2523/display/redirect?page=changes>

Changes:

[jason] KAFKA-6739; Ignore headers when down-converting from V2 to V0/V1 (#4813)

------------------------------------------
[...truncated 422.24 KB...]

kafka.controller.ReplicaStateMachineTest > testInvalidOfflineReplicaToReplicaDeletionIneligibleTransition
PASSED

kafka.controller.ReplicaStateMachineTest > testNewReplicaToOfflineReplicaTransition STARTED

kafka.controller.ReplicaStateMachineTest > testNewReplicaToOfflineReplicaTransition PASSED

kafka.controller.ReplicaStateMachineTest > testInvalidReplicaDeletionSuccessfulToOnlineReplicaTransition
STARTED

kafka.controller.ReplicaStateMachineTest > testInvalidReplicaDeletionSuccessfulToOnlineReplicaTransition
PASSED

kafka.controller.ReplicaStateMachineTest > testInvalidNonexistentReplicaToReplicaDeletionStartedTransition
STARTED

kafka.controller.ReplicaStateMachineTest > testInvalidNonexistentReplicaToReplicaDeletionStartedTransition
PASSED

kafka.controller.ReplicaStateMachineTest > testInvalidOnlineReplicaToReplicaDeletionSuccessfulTransition
STARTED

kafka.controller.ReplicaStateMachineTest > testInvalidOnlineReplicaToReplicaDeletionSuccessfulTransition
PASSED

kafka.controller.ReplicaStateMachineTest > testInvalidOfflineReplicaToNonexistentReplicaTransition
STARTED

kafka.controller.ReplicaStateMachineTest > testInvalidOfflineReplicaToNonexistentReplicaTransition
PASSED

kafka.controller.ReplicaStateMachineTest > testInvalidOnlineReplicaToReplicaDeletionIneligibleTransition
STARTED

kafka.controller.ReplicaStateMachineTest > testInvalidOnlineReplicaToReplicaDeletionIneligibleTransition
PASSED

kafka.controller.ReplicaStateMachineTest > testInvalidReplicaDeletionSuccessfulToReplicaDeletionStartedTransition
STARTED

kafka.controller.ReplicaStateMachineTest > testInvalidReplicaDeletionSuccessfulToReplicaDeletionStartedTransition
PASSED

kafka.controller.ReplicaStateMachineTest > testInvalidNewReplicaToReplicaDeletionSuccessfulTransition
STARTED

kafka.controller.ReplicaStateMachineTest > testInvalidNewReplicaToReplicaDeletionSuccessfulTransition
PASSED

kafka.controller.ReplicaStateMachineTest > testInvalidReplicaDeletionIneligibleToReplicaDeletionStartedTransition
STARTED

kafka.controller.ReplicaStateMachineTest > testInvalidReplicaDeletionIneligibleToReplicaDeletionStartedTransition
PASSED

kafka.controller.ReplicaStateMachineTest > testInvalidReplicaDeletionStartedToOfflineReplicaTransition
STARTED

kafka.controller.ReplicaStateMachineTest > testInvalidReplicaDeletionStartedToOfflineReplicaTransition
PASSED

kafka.controller.ReplicaStateMachineTest > testInvalidNewReplicaToReplicaDeletionStartedTransition
STARTED

kafka.controller.ReplicaStateMachineTest > testInvalidNewReplicaToReplicaDeletionStartedTransition
PASSED

kafka.controller.ReplicaStateMachineTest > testOnlineReplicaToOnlineReplicaTransition STARTED

kafka.controller.ReplicaStateMachineTest > testOnlineReplicaToOnlineReplicaTransition PASSED

kafka.controller.ReplicaStateMachineTest > testInvalidNewReplicaToReplicaDeletionIneligibleTransition
STARTED

kafka.controller.ReplicaStateMachineTest > testInvalidNewReplicaToReplicaDeletionIneligibleTransition
PASSED

kafka.controller.ReplicaStateMachineTest > testInvalidNonexistentReplicaToOfflineReplicaTransition
STARTED

kafka.controller.ReplicaStateMachineTest > testInvalidNonexistentReplicaToOfflineReplicaTransition
PASSED

kafka.controller.ReplicaStateMachineTest > testReplicaDeletionStartedToReplicaDeletionSuccessfulTransition
STARTED

kafka.controller.ReplicaStateMachineTest > testReplicaDeletionStartedToReplicaDeletionSuccessfulTransition
PASSED

kafka.controller.ReplicaStateMachineTest > testInvalidNonexistentReplicaToOnlineReplicaTransition
STARTED

kafka.controller.ReplicaStateMachineTest > testInvalidNonexistentReplicaToOnlineReplicaTransition
PASSED

kafka.controller.ReplicaStateMachineTest > testInvalidOnlineReplicaToNewReplicaTransition
STARTED

kafka.controller.ReplicaStateMachineTest > testInvalidOnlineReplicaToNewReplicaTransition
PASSED

kafka.controller.ReplicaStateMachineTest > testReplicaDeletionStartedToReplicaDeletionIneligibleTransition
STARTED

kafka.controller.ReplicaStateMachineTest > testReplicaDeletionStartedToReplicaDeletionIneligibleTransition
PASSED

kafka.controller.ReplicaStateMachineTest > testInvalidReplicaDeletionSuccessfulToOfflineReplicaTransition
STARTED

kafka.controller.ReplicaStateMachineTest > testInvalidReplicaDeletionSuccessfulToOfflineReplicaTransition
PASSED

kafka.controller.ReplicaStateMachineTest > testInvalidReplicaDeletionIneligibleToNewReplicaTransition
STARTED

kafka.controller.ReplicaStateMachineTest > testInvalidReplicaDeletionIneligibleToNewReplicaTransition
PASSED

kafka.controller.ReplicaStateMachineTest > testReplicaDeletionIneligibleToOnlineReplicaTransition
STARTED

kafka.controller.ReplicaStateMachineTest > testReplicaDeletionIneligibleToOnlineReplicaTransition
PASSED

kafka.controller.ReplicaStateMachineTest > testInvalidReplicaDeletionStartedToNewReplicaTransition
STARTED

kafka.controller.ReplicaStateMachineTest > testInvalidReplicaDeletionStartedToNewReplicaTransition
PASSED

kafka.controller.ReplicaStateMachineTest > testInvalidNonexistentReplicaToReplicaDeletionSuccessfulTransition
STARTED

kafka.controller.ReplicaStateMachineTest > testInvalidNonexistentReplicaToReplicaDeletionSuccessfulTransition
PASSED

kafka.controller.ReplicaStateMachineTest > testNewReplicaToOnlineReplicaTransition STARTED

kafka.controller.ReplicaStateMachineTest > testNewReplicaToOnlineReplicaTransition PASSED

kafka.controller.ControllerIntegrationTest > testPartitionReassignmentWithOfflineReplicaHaltingProgress
STARTED

kafka.controller.ControllerIntegrationTest > testPartitionReassignmentWithOfflineReplicaHaltingProgress
PASSED

kafka.controller.ControllerIntegrationTest > testControllerEpochPersistsWhenAllBrokersDown
STARTED

kafka.controller.ControllerIntegrationTest > testControllerEpochPersistsWhenAllBrokersDown
PASSED

kafka.controller.ControllerIntegrationTest > testTopicCreationWithOfflineReplica STARTED

kafka.controller.ControllerIntegrationTest > testTopicCreationWithOfflineReplica PASSED

kafka.controller.ControllerIntegrationTest > testPartitionReassignmentResumesAfterReplicaComesOnline
STARTED

kafka.controller.ControllerIntegrationTest > testPartitionReassignmentResumesAfterReplicaComesOnline
PASSED

kafka.controller.ControllerIntegrationTest > testLeaderAndIsrWhenEntireIsrOfflineAndUncleanLeaderElectionDisabled
STARTED

kafka.controller.ControllerIntegrationTest > testLeaderAndIsrWhenEntireIsrOfflineAndUncleanLeaderElectionDisabled
PASSED

kafka.controller.ControllerIntegrationTest > testTopicPartitionExpansionWithOfflineReplica
STARTED

kafka.controller.ControllerIntegrationTest > testTopicPartitionExpansionWithOfflineReplica
PASSED

kafka.controller.ControllerIntegrationTest > testPreferredReplicaLeaderElectionWithOfflinePreferredReplica
STARTED

kafka.controller.ControllerIntegrationTest > testPreferredReplicaLeaderElectionWithOfflinePreferredReplica
PASSED

kafka.controller.ControllerIntegrationTest > testAutoPreferredReplicaLeaderElection STARTED

kafka.controller.ControllerIntegrationTest > testAutoPreferredReplicaLeaderElection PASSED

kafka.controller.ControllerIntegrationTest > testTopicCreation STARTED

kafka.controller.ControllerIntegrationTest > testTopicCreation PASSED

kafka.controller.ControllerIntegrationTest > testPartitionReassignment STARTED

kafka.controller.ControllerIntegrationTest > testPartitionReassignment PASSED

kafka.controller.ControllerIntegrationTest > testTopicPartitionExpansion STARTED

kafka.controller.ControllerIntegrationTest > testTopicPartitionExpansion PASSED

kafka.controller.ControllerIntegrationTest > testControllerMoveIncrementsControllerEpoch
STARTED

kafka.controller.ControllerIntegrationTest > testControllerMoveIncrementsControllerEpoch
PASSED

kafka.controller.ControllerIntegrationTest > testLeaderAndIsrWhenEntireIsrOfflineAndUncleanLeaderElectionEnabled
STARTED

kafka.controller.ControllerIntegrationTest > testLeaderAndIsrWhenEntireIsrOfflineAndUncleanLeaderElectionEnabled
PASSED

kafka.controller.ControllerIntegrationTest > testBackToBackPreferredReplicaLeaderElections
STARTED

kafka.controller.ControllerIntegrationTest > testBackToBackPreferredReplicaLeaderElections
PASSED

kafka.controller.ControllerIntegrationTest > testEmptyCluster STARTED

kafka.controller.ControllerIntegrationTest > testEmptyCluster PASSED

kafka.controller.ControllerIntegrationTest > testPreferredReplicaLeaderElection STARTED

kafka.controller.ControllerIntegrationTest > testPreferredReplicaLeaderElection PASSED

unit.kafka.admin.DeleteConsumerGroupTest > testDeleteCmdInvalidGroupId STARTED

unit.kafka.admin.DeleteConsumerGroupTest > testDeleteCmdInvalidGroupId PASSED

unit.kafka.admin.DeleteConsumerGroupTest > testDeleteNonEmptyGroup STARTED

unit.kafka.admin.DeleteConsumerGroupTest > testDeleteNonEmptyGroup PASSED

unit.kafka.admin.DeleteConsumerGroupTest > testDeleteCmdWithMixOfSuccessAndError STARTED

unit.kafka.admin.DeleteConsumerGroupTest > testDeleteCmdWithMixOfSuccessAndError PASSED

unit.kafka.admin.DeleteConsumerGroupTest > testDeleteWithShortInitialization STARTED

unit.kafka.admin.DeleteConsumerGroupTest > testDeleteWithShortInitialization PASSED

unit.kafka.admin.DeleteConsumerGroupTest > testDeleteCmdWithShortInitialization STARTED

unit.kafka.admin.DeleteConsumerGroupTest > testDeleteCmdWithShortInitialization PASSED

unit.kafka.admin.DeleteConsumerGroupTest > testDeleteWithTopicOption STARTED

unit.kafka.admin.DeleteConsumerGroupTest > testDeleteWithTopicOption PASSED

unit.kafka.admin.DeleteConsumerGroupTest > testDeleteNonExistingGroup STARTED

unit.kafka.admin.DeleteConsumerGroupTest > testDeleteNonExistingGroup PASSED

unit.kafka.admin.DeleteConsumerGroupTest > testDeleteCmdNonEmptyGroup STARTED

unit.kafka.admin.DeleteConsumerGroupTest > testDeleteCmdNonEmptyGroup PASSED

unit.kafka.admin.DeleteConsumerGroupTest > testDeleteCmdNonExistingGroup STARTED

unit.kafka.admin.DeleteConsumerGroupTest > testDeleteCmdNonExistingGroup PASSED

unit.kafka.admin.DeleteConsumerGroupTest > testDeleteEmptyGroup STARTED

unit.kafka.admin.DeleteConsumerGroupTest > testDeleteEmptyGroup PASSED

unit.kafka.admin.DeleteConsumerGroupTest > testDeleteWithMixOfSuccessAndError STARTED

unit.kafka.admin.DeleteConsumerGroupTest > testDeleteWithMixOfSuccessAndError PASSED

unit.kafka.admin.DeleteConsumerGroupTest > testDeleteCmdEmptyGroup STARTED

unit.kafka.admin.DeleteConsumerGroupTest > testDeleteCmdEmptyGroup PASSED

unit.kafka.admin.DeleteConsumerGroupTest > testDeleteInvalidGroupId STARTED

unit.kafka.admin.DeleteConsumerGroupTest > testDeleteInvalidGroupId PASSED

1912 tests completed, 1 failed, 6 skipped
:kafka-trunk-jdk8:core:test FAILED
:test_core_2_11 FAILED

FAILURE: Build failed with an exception.

* What went wrong:
Execution failed for task ':kafka-trunk-jdk8:core:test'.
> There were failing tests. See the report at: file://<https://builds.apache.org/job/kafka-trunk-jdk8/ws/core/build/reports/tests/test/index.html>

* Try:
Run with --stacktrace option to get the stack trace. Run with --info or --debug option to
get more log output. Run with --scan to get full insights.

* Get more help at https://help.gradle.org

BUILD FAILED in 1h 27m 16s
17 actionable tasks: 2 executed, 15 up-to-date
Build step 'Execute shell' marked build as failure
[FINDBUGS] Collecting findbugs analysis files...
Setting GRADLE_4_4_HOME=/home/jenkins/tools/gradle/4.4
[FINDBUGS] Searching for all files in <https://builds.apache.org/job/kafka-trunk-jdk8/ws/>
that match the pattern **/build/reports/findbugs/*.xml
[FINDBUGS] Parsing 1 file in <https://builds.apache.org/job/kafka-trunk-jdk8/ws/>
[FINDBUGS] Successfully parsed file <https://builds.apache.org/job/kafka-trunk-jdk8/ws/core/build/reports/findbugs/main.xml>
with 0 unique warnings and 0 duplicates.
Setting GRADLE_4_4_HOME=/home/jenkins/tools/gradle/4.4
Setting GRADLE_4_4_HOME=/home/jenkins/tools/gradle/4.4
<Git Blamer> Using GitBlamer to create author and commit information for all warnings.
<Git Blamer> GIT_COMMIT=719a21f7c9fefc6ebe16089b2a5e4c155fde8b16, workspace=<https://builds.apache.org/job/kafka-trunk-jdk8/ws/>
[FINDBUGS] Computing warning deltas based on reference build #2519
Recording test results
Setting GRADLE_4_4_HOME=/home/jenkins/tools/gradle/4.4
Setting GRADLE_4_4_HOME=/home/jenkins/tools/gradle/4.4
Not sending mail to unregistered user wangguoz@gmail.com
Not sending mail to unregistered user rajinisivaram@googlemail.com
Not sending mail to unregistered user github@alasdairhodge.co.uk

Mime
View raw message