kafka-dev mailing list archives

Site index · List index
Message view « Date » · « Thread »
Top « Date » · « Thread »
From Apache Jenkins Server <jenk...@builds.apache.org>
Subject Build failed in Jenkins: kafka-trunk-jdk8 #2555
Date Mon, 16 Apr 2018 20:53:08 GMT
See <https://builds.apache.org/job/kafka-trunk-jdk8/2555/display/redirect?page=changes>

Changes:

[jason] MINOR: Mention that -1 disables retention by time (#4881)

[jason] KAFKA-6514; Add API version as a tag for the RequestsPerSec metric

[wangguoz] Kafka-6792: Fix wrong pointer in the link for stream dsl (#4876)

------------------------------------------
[...truncated 418.11 KB...]
kafka.zookeeper.ZooKeeperClientTest > testPipelinedGetData STARTED

kafka.zookeeper.ZooKeeperClientTest > testPipelinedGetData PASSED

kafka.zookeeper.ZooKeeperClientTest > testZNodeChildChangeHandlerForChildChange STARTED

kafka.zookeeper.ZooKeeperClientTest > testZNodeChildChangeHandlerForChildChange PASSED

kafka.zookeeper.ZooKeeperClientTest > testGetChildrenExistingZNodeWithChildren STARTED

kafka.zookeeper.ZooKeeperClientTest > testGetChildrenExistingZNodeWithChildren PASSED

kafka.zookeeper.ZooKeeperClientTest > testSetDataExistingZNode STARTED

kafka.zookeeper.ZooKeeperClientTest > testSetDataExistingZNode PASSED

kafka.zookeeper.ZooKeeperClientTest > testMixedPipeline STARTED

kafka.zookeeper.ZooKeeperClientTest > testMixedPipeline PASSED

kafka.zookeeper.ZooKeeperClientTest > testGetDataExistingZNode STARTED

kafka.zookeeper.ZooKeeperClientTest > testGetDataExistingZNode PASSED

kafka.zookeeper.ZooKeeperClientTest > testDeleteExistingZNode STARTED

kafka.zookeeper.ZooKeeperClientTest > testDeleteExistingZNode PASSED

kafka.zookeeper.ZooKeeperClientTest > testSessionExpiry STARTED

kafka.zookeeper.ZooKeeperClientTest > testSessionExpiry PASSED

kafka.zookeeper.ZooKeeperClientTest > testSetDataNonExistentZNode STARTED

kafka.zookeeper.ZooKeeperClientTest > testSetDataNonExistentZNode PASSED

kafka.zookeeper.ZooKeeperClientTest > testDeleteNonExistentZNode STARTED

kafka.zookeeper.ZooKeeperClientTest > testDeleteNonExistentZNode PASSED

kafka.zookeeper.ZooKeeperClientTest > testExistsExistingZNode STARTED

kafka.zookeeper.ZooKeeperClientTest > testExistsExistingZNode PASSED

kafka.zookeeper.ZooKeeperClientTest > testZooKeeperStateChangeRateMetrics STARTED

kafka.zookeeper.ZooKeeperClientTest > testZooKeeperStateChangeRateMetrics PASSED

kafka.zookeeper.ZooKeeperClientTest > testZNodeChangeHandlerForDeletion STARTED

kafka.zookeeper.ZooKeeperClientTest > testZNodeChangeHandlerForDeletion PASSED

kafka.zookeeper.ZooKeeperClientTest > testGetAclNonExistentZNode STARTED

kafka.zookeeper.ZooKeeperClientTest > testGetAclNonExistentZNode PASSED

kafka.zookeeper.ZooKeeperClientTest > testStateChangeHandlerForAuthFailure STARTED

kafka.zookeeper.ZooKeeperClientTest > testStateChangeHandlerForAuthFailure PASSED

kafka.network.SocketServerTest > testGracefulClose STARTED

kafka.network.SocketServerTest > testGracefulClose PASSED

kafka.network.SocketServerTest > controlThrowable STARTED

kafka.network.SocketServerTest > controlThrowable PASSED

kafka.network.SocketServerTest > testRequestMetricsAfterStop STARTED

kafka.network.SocketServerTest > testRequestMetricsAfterStop PASSED

kafka.network.SocketServerTest > testConnectionIdReuse STARTED

kafka.network.SocketServerTest > testConnectionIdReuse PASSED

kafka.network.SocketServerTest > testClientDisconnectionUpdatesRequestMetrics STARTED

kafka.network.SocketServerTest > testClientDisconnectionUpdatesRequestMetrics PASSED

kafka.network.SocketServerTest > testProcessorMetricsTags STARTED

kafka.network.SocketServerTest > testProcessorMetricsTags PASSED

kafka.network.SocketServerTest > testMaxConnectionsPerIp STARTED

kafka.network.SocketServerTest > testMaxConnectionsPerIp PASSED

kafka.network.SocketServerTest > testConnectionId STARTED

kafka.network.SocketServerTest > testConnectionId PASSED

kafka.network.SocketServerTest > testBrokerSendAfterChannelClosedUpdatesRequestMetrics
STARTED

kafka.network.SocketServerTest > testBrokerSendAfterChannelClosedUpdatesRequestMetrics
PASSED

kafka.network.SocketServerTest > testNoOpAction STARTED

kafka.network.SocketServerTest > testNoOpAction PASSED

kafka.network.SocketServerTest > simpleRequest STARTED

kafka.network.SocketServerTest > simpleRequest PASSED

kafka.network.SocketServerTest > closingChannelException STARTED

kafka.network.SocketServerTest > closingChannelException PASSED

kafka.network.SocketServerTest > testIdleConnection STARTED

kafka.network.SocketServerTest > testIdleConnection PASSED

kafka.network.SocketServerTest > testClientDisconnectionWithStagedReceivesFullyProcessed
STARTED

kafka.network.SocketServerTest > testClientDisconnectionWithStagedReceivesFullyProcessed
PASSED

kafka.network.SocketServerTest > testZeroMaxConnectionsPerIp STARTED

kafka.network.SocketServerTest > testZeroMaxConnectionsPerIp PASSED

kafka.network.SocketServerTest > testMetricCollectionAfterShutdown STARTED

kafka.network.SocketServerTest > testMetricCollectionAfterShutdown PASSED

kafka.network.SocketServerTest > testSessionPrincipal STARTED

kafka.network.SocketServerTest > testSessionPrincipal PASSED

kafka.network.SocketServerTest > configureNewConnectionException STARTED

kafka.network.SocketServerTest > configureNewConnectionException PASSED

kafka.network.SocketServerTest > testMaxConnectionsPerIpOverrides STARTED

kafka.network.SocketServerTest > testMaxConnectionsPerIpOverrides PASSED

kafka.network.SocketServerTest > processNewResponseException STARTED

kafka.network.SocketServerTest > processNewResponseException PASSED

kafka.network.SocketServerTest > processCompletedSendException STARTED

kafka.network.SocketServerTest > processCompletedSendException PASSED

kafka.network.SocketServerTest > processDisconnectedException STARTED

kafka.network.SocketServerTest > processDisconnectedException PASSED

kafka.network.SocketServerTest > sendCancelledKeyException STARTED

kafka.network.SocketServerTest > sendCancelledKeyException PASSED

kafka.network.SocketServerTest > processCompletedReceiveException STARTED

kafka.network.SocketServerTest > processCompletedReceiveException PASSED

kafka.network.SocketServerTest > testSocketsCloseOnShutdown STARTED

kafka.network.SocketServerTest > testSocketsCloseOnShutdown PASSED

kafka.network.SocketServerTest > pollException STARTED

kafka.network.SocketServerTest > pollException PASSED

kafka.network.SocketServerTest > testSslSocketServer STARTED

kafka.network.SocketServerTest > testSslSocketServer PASSED

kafka.network.SocketServerTest > tooBigRequestIsRejected STARTED

kafka.network.SocketServerTest > tooBigRequestIsRejected PASSED

unit.kafka.admin.DeleteConsumerGroupTest > testDeleteNonEmptyGroup STARTED

unit.kafka.admin.DeleteConsumerGroupTest > testDeleteNonEmptyGroup PASSED

unit.kafka.admin.DeleteConsumerGroupTest > testDeleteCmdWithMixOfSuccessAndError STARTED

unit.kafka.admin.DeleteConsumerGroupTest > testDeleteCmdWithMixOfSuccessAndError PASSED

unit.kafka.admin.DeleteConsumerGroupTest > testDeleteWithShortInitialization STARTED

unit.kafka.admin.DeleteConsumerGroupTest > testDeleteWithShortInitialization PASSED

unit.kafka.admin.DeleteConsumerGroupTest > testDeleteCmdWithShortInitialization STARTED

unit.kafka.admin.DeleteConsumerGroupTest > testDeleteCmdWithShortInitialization PASSED

unit.kafka.admin.DeleteConsumerGroupTest > testDeleteWithTopicOption STARTED

unit.kafka.admin.DeleteConsumerGroupTest > testDeleteWithTopicOption PASSED

unit.kafka.admin.DeleteConsumerGroupTest > testDeleteNonExistingGroup STARTED

unit.kafka.admin.DeleteConsumerGroupTest > testDeleteNonExistingGroup PASSED

unit.kafka.admin.DeleteConsumerGroupTest > testDeleteCmdNonEmptyGroup STARTED

unit.kafka.admin.DeleteConsumerGroupTest > testDeleteCmdNonEmptyGroup PASSED

unit.kafka.admin.DeleteConsumerGroupTest > testDeleteCmdNonExistingGroup STARTED

unit.kafka.admin.DeleteConsumerGroupTest > testDeleteCmdNonExistingGroup PASSED

unit.kafka.admin.DeleteConsumerGroupTest > testDeleteEmptyGroup STARTED

unit.kafka.admin.DeleteConsumerGroupTest > testDeleteEmptyGroup PASSED

unit.kafka.admin.DeleteConsumerGroupTest > testDeleteWithMixOfSuccessAndError STARTED

unit.kafka.admin.DeleteConsumerGroupTest > testDeleteWithMixOfSuccessAndError PASSED

unit.kafka.admin.DeleteConsumerGroupTest > testDeleteCmdEmptyGroup STARTED

unit.kafka.admin.DeleteConsumerGroupTest > testDeleteCmdEmptyGroup PASSED

1916 tests completed, 1 failed, 4 skipped
:kafka-trunk-jdk8:core:test FAILED
:test_core_2_11 FAILED

FAILURE: Build failed with an exception.

* What went wrong:
Execution failed for task ':kafka-trunk-jdk8:core:test'.
> There were failing tests. See the report at: file://<https://builds.apache.org/job/kafka-trunk-jdk8/ws/core/build/reports/tests/test/index.html>

* Try:
Run with --stacktrace option to get the stack trace. Run with --info or --debug option to
get more log output. Run with --scan to get full insights.

* Get more help at https://help.gradle.org

BUILD FAILED in 1h 40m 24s
22 actionable tasks: 3 executed, 19 up-to-date
Build step 'Execute shell' marked build as failure
[FINDBUGS] Collecting findbugs analysis files...
Setting GRADLE_4_4_HOME=/home/jenkins/tools/gradle/4.4
[FINDBUGS] Searching for all files in <https://builds.apache.org/job/kafka-trunk-jdk8/ws/>
that match the pattern **/build/reports/findbugs/*.xml
[FINDBUGS] Parsing 1 file in <https://builds.apache.org/job/kafka-trunk-jdk8/ws/>
[FINDBUGS] Successfully parsed file <https://builds.apache.org/job/kafka-trunk-jdk8/ws/core/build/reports/findbugs/main.xml>
with 0 unique warnings and 0 duplicates.
Setting GRADLE_4_4_HOME=/home/jenkins/tools/gradle/4.4
Setting GRADLE_4_4_HOME=/home/jenkins/tools/gradle/4.4
<Git Blamer> Using GitBlamer to create author and commit information for all warnings.
<Git Blamer> GIT_COMMIT=b6f04203501bddd355b5663861b559b4bbc90d8f, workspace=<https://builds.apache.org/job/kafka-trunk-jdk8/ws/>
[FINDBUGS] Computing warning deltas based on reference build #2551
Recording test results
Setting GRADLE_4_4_HOME=/home/jenkins/tools/gradle/4.4
Setting GRADLE_4_4_HOME=/home/jenkins/tools/gradle/4.4
Not sending mail to unregistered user wangguoz@gmail.com
Not sending mail to unregistered user rajinisivaram@googlemail.com

Mime
View raw message