kafka-dev mailing list archives

Site index · List index
Message view « Date » · « Thread »
Top « Date » · « Thread »
From Apache Jenkins Server <jenk...@builds.apache.org>
Subject Build failed in Jenkins: kafka-trunk-jdk9 #527
Date Tue, 03 Apr 2018 18:37:43 GMT
See <https://builds.apache.org/job/kafka-trunk-jdk9/527/display/redirect?page=changes>

Changes:

[me] MINOR: Make kafka-streams-test-utils dependencies work with releases

[me] KAFKA-6728: Corrected the worker’s instantiation of the HeaderConverter

[wangguoz] MINOR: Refactor return value (#4810)

------------------------------------------
[...truncated 1.48 MB...]
kafka.controller.ControllerEventManagerTest > testEventThatThrowsException STARTED

kafka.controller.ControllerEventManagerTest > testEventThatThrowsException PASSED

kafka.controller.ControllerEventManagerTest > testSuccessfulEvent STARTED

kafka.controller.ControllerEventManagerTest > testSuccessfulEvent PASSED

kafka.controller.ControllerFailoverTest > testHandleIllegalStateException STARTED

kafka.controller.ControllerFailoverTest > testHandleIllegalStateException PASSED

kafka.controller.PartitionLeaderElectionAlgorithmsTest > testPreferredReplicaPartitionLeaderElectionPreferredReplicaNotInIsrLive
STARTED

kafka.controller.PartitionLeaderElectionAlgorithmsTest > testPreferredReplicaPartitionLeaderElectionPreferredReplicaNotInIsrLive
PASSED

kafka.controller.PartitionLeaderElectionAlgorithmsTest > testControlledShutdownPartitionLeaderElectionLastIsrShuttingDown
STARTED

kafka.controller.PartitionLeaderElectionAlgorithmsTest > testControlledShutdownPartitionLeaderElectionLastIsrShuttingDown
PASSED

kafka.controller.PartitionLeaderElectionAlgorithmsTest > testControlledShutdownPartitionLeaderElection
STARTED

kafka.controller.PartitionLeaderElectionAlgorithmsTest > testControlledShutdownPartitionLeaderElection
PASSED

kafka.controller.PartitionLeaderElectionAlgorithmsTest > testPreferredReplicaPartitionLeaderElectionPreferredReplicaInIsrNotLive
STARTED

kafka.controller.PartitionLeaderElectionAlgorithmsTest > testPreferredReplicaPartitionLeaderElectionPreferredReplicaInIsrNotLive
PASSED

kafka.controller.PartitionLeaderElectionAlgorithmsTest > testReassignPartitionLeaderElectionWithNoLiveIsr
STARTED

kafka.controller.PartitionLeaderElectionAlgorithmsTest > testReassignPartitionLeaderElectionWithNoLiveIsr
PASSED

kafka.controller.PartitionLeaderElectionAlgorithmsTest > testReassignPartitionLeaderElection
STARTED

kafka.controller.PartitionLeaderElectionAlgorithmsTest > testReassignPartitionLeaderElection
PASSED

kafka.controller.PartitionLeaderElectionAlgorithmsTest > testOfflinePartitionLeaderElection
STARTED

kafka.controller.PartitionLeaderElectionAlgorithmsTest > testOfflinePartitionLeaderElection
PASSED

kafka.controller.PartitionLeaderElectionAlgorithmsTest > testPreferredReplicaPartitionLeaderElection
STARTED

kafka.controller.PartitionLeaderElectionAlgorithmsTest > testPreferredReplicaPartitionLeaderElection
PASSED

kafka.controller.PartitionLeaderElectionAlgorithmsTest > testReassignPartitionLeaderElectionWithEmptyIsr
STARTED

kafka.controller.PartitionLeaderElectionAlgorithmsTest > testReassignPartitionLeaderElectionWithEmptyIsr
PASSED

kafka.controller.PartitionLeaderElectionAlgorithmsTest > testControlledShutdownPartitionLeaderElectionAllIsrSimultaneouslyShutdown
STARTED

kafka.controller.PartitionLeaderElectionAlgorithmsTest > testControlledShutdownPartitionLeaderElectionAllIsrSimultaneouslyShutdown
PASSED

kafka.controller.PartitionLeaderElectionAlgorithmsTest > testOfflinePartitionLeaderElectionLastIsrOfflineUncleanLeaderElectionEnabled
STARTED

kafka.controller.PartitionLeaderElectionAlgorithmsTest > testOfflinePartitionLeaderElectionLastIsrOfflineUncleanLeaderElectionEnabled
PASSED

kafka.controller.PartitionLeaderElectionAlgorithmsTest > testPreferredReplicaPartitionLeaderElectionPreferredReplicaNotInIsrNotLive
STARTED

kafka.controller.PartitionLeaderElectionAlgorithmsTest > testPreferredReplicaPartitionLeaderElectionPreferredReplicaNotInIsrNotLive
PASSED

kafka.controller.PartitionLeaderElectionAlgorithmsTest > testOfflinePartitionLeaderElectionLastIsrOfflineUncleanLeaderElectionDisabled
STARTED

kafka.controller.PartitionLeaderElectionAlgorithmsTest > testOfflinePartitionLeaderElectionLastIsrOfflineUncleanLeaderElectionDisabled
PASSED

kafka.network.SocketServerTest > testGracefulClose STARTED

kafka.network.SocketServerTest > testGracefulClose PASSED

kafka.network.SocketServerTest > controlThrowable STARTED

kafka.network.SocketServerTest > controlThrowable PASSED

kafka.network.SocketServerTest > testRequestMetricsAfterStop STARTED

kafka.network.SocketServerTest > testRequestMetricsAfterStop PASSED

kafka.network.SocketServerTest > testConnectionIdReuse STARTED

kafka.network.SocketServerTest > testConnectionIdReuse PASSED

kafka.network.SocketServerTest > testClientDisconnectionUpdatesRequestMetrics STARTED

kafka.network.SocketServerTest > testClientDisconnectionUpdatesRequestMetrics PASSED

kafka.network.SocketServerTest > testProcessorMetricsTags STARTED

kafka.network.SocketServerTest > testProcessorMetricsTags PASSED

kafka.network.SocketServerTest > testMaxConnectionsPerIp STARTED

kafka.network.SocketServerTest > testMaxConnectionsPerIp PASSED

kafka.network.SocketServerTest > testConnectionId STARTED

kafka.network.SocketServerTest > testConnectionId PASSED

kafka.network.SocketServerTest > testBrokerSendAfterChannelClosedUpdatesRequestMetrics
STARTED

kafka.network.SocketServerTest > testBrokerSendAfterChannelClosedUpdatesRequestMetrics
PASSED

kafka.network.SocketServerTest > testNoOpAction STARTED

kafka.network.SocketServerTest > testNoOpAction PASSED

kafka.network.SocketServerTest > simpleRequest STARTED

kafka.network.SocketServerTest > simpleRequest PASSED

kafka.network.SocketServerTest > closingChannelException STARTED

kafka.network.SocketServerTest > closingChannelException PASSED

kafka.network.SocketServerTest > testIdleConnection STARTED

kafka.network.SocketServerTest > testIdleConnection PASSED

kafka.network.SocketServerTest > testClientDisconnectionWithStagedReceivesFullyProcessed
STARTED

kafka.network.SocketServerTest > testClientDisconnectionWithStagedReceivesFullyProcessed
PASSED

kafka.network.SocketServerTest > testZeroMaxConnectionsPerIp STARTED

kafka.network.SocketServerTest > testZeroMaxConnectionsPerIp PASSED

kafka.network.SocketServerTest > testMetricCollectionAfterShutdown STARTED

kafka.network.SocketServerTest > testMetricCollectionAfterShutdown PASSED

kafka.network.SocketServerTest > testSessionPrincipal STARTED

kafka.network.SocketServerTest > testSessionPrincipal PASSED

kafka.network.SocketServerTest > configureNewConnectionException STARTED

kafka.network.SocketServerTest > configureNewConnectionException PASSED

kafka.network.SocketServerTest > testMaxConnectionsPerIpOverrides STARTED

kafka.network.SocketServerTest > testMaxConnectionsPerIpOverrides PASSED

kafka.network.SocketServerTest > processNewResponseException STARTED

kafka.network.SocketServerTest > processNewResponseException PASSED

kafka.network.SocketServerTest > processCompletedSendException STARTED

kafka.network.SocketServerTest > processCompletedSendException PASSED

kafka.network.SocketServerTest > processDisconnectedException STARTED

kafka.network.SocketServerTest > processDisconnectedException PASSED

kafka.network.SocketServerTest > sendCancelledKeyException STARTED

kafka.network.SocketServerTest > sendCancelledKeyException PASSED

kafka.network.SocketServerTest > processCompletedReceiveException STARTED

kafka.network.SocketServerTest > processCompletedReceiveException PASSED

kafka.network.SocketServerTest > testSocketsCloseOnShutdown STARTED

kafka.network.SocketServerTest > testSocketsCloseOnShutdown PASSED

kafka.network.SocketServerTest > pollException STARTED

kafka.network.SocketServerTest > pollException PASSED

kafka.network.SocketServerTest > testSslSocketServer STARTED

kafka.network.SocketServerTest > testSslSocketServer PASSED

kafka.network.SocketServerTest > tooBigRequestIsRejected STARTED

kafka.network.SocketServerTest > tooBigRequestIsRejected PASSED

unit.kafka.admin.DeleteConsumerGroupTest > testDeleteCmdInvalidGroupId STARTED

unit.kafka.admin.DeleteConsumerGroupTest > testDeleteCmdInvalidGroupId PASSED

unit.kafka.admin.DeleteConsumerGroupTest > testDeleteNonEmptyGroup STARTED

unit.kafka.admin.DeleteConsumerGroupTest > testDeleteNonEmptyGroup PASSED

unit.kafka.admin.DeleteConsumerGroupTest > testDeleteCmdWithMixOfSuccessAndError STARTED

unit.kafka.admin.DeleteConsumerGroupTest > testDeleteCmdWithMixOfSuccessAndError PASSED

unit.kafka.admin.DeleteConsumerGroupTest > testDeleteWithShortInitialization STARTED

unit.kafka.admin.DeleteConsumerGroupTest > testDeleteWithShortInitialization PASSED

unit.kafka.admin.DeleteConsumerGroupTest > testDeleteCmdWithShortInitialization STARTED

unit.kafka.admin.DeleteConsumerGroupTest > testDeleteCmdWithShortInitialization PASSED

unit.kafka.admin.DeleteConsumerGroupTest > testDeleteWithTopicOption STARTED

unit.kafka.admin.DeleteConsumerGroupTest > testDeleteWithTopicOption PASSED

unit.kafka.admin.DeleteConsumerGroupTest > testDeleteNonExistingGroup STARTED

unit.kafka.admin.DeleteConsumerGroupTest > testDeleteNonExistingGroup PASSED

unit.kafka.admin.DeleteConsumerGroupTest > testDeleteCmdNonEmptyGroup STARTED

unit.kafka.admin.DeleteConsumerGroupTest > testDeleteCmdNonEmptyGroup PASSED

unit.kafka.admin.DeleteConsumerGroupTest > testDeleteCmdNonExistingGroup STARTED

unit.kafka.admin.DeleteConsumerGroupTest > testDeleteCmdNonExistingGroup PASSED

unit.kafka.admin.DeleteConsumerGroupTest > testDeleteEmptyGroup STARTED

unit.kafka.admin.DeleteConsumerGroupTest > testDeleteEmptyGroup PASSED

unit.kafka.admin.DeleteConsumerGroupTest > testDeleteWithMixOfSuccessAndError STARTED

unit.kafka.admin.DeleteConsumerGroupTest > testDeleteWithMixOfSuccessAndError PASSED

unit.kafka.admin.DeleteConsumerGroupTest > testDeleteCmdEmptyGroup STARTED

unit.kafka.admin.DeleteConsumerGroupTest > testDeleteCmdEmptyGroup PASSED

unit.kafka.admin.DeleteConsumerGroupTest > testDeleteInvalidGroupId STARTED

unit.kafka.admin.DeleteConsumerGroupTest > testDeleteInvalidGroupId PASSED

1912 tests completed, 3 failed, 6 skipped
:core:test FAILED

FAILURE: Build failed with an exception.

* What went wrong:
Execution failed for task ':core:test'.
> There were failing tests. See the report at: file://<https://builds.apache.org/job/kafka-trunk-jdk9/ws/core/build/reports/tests/test/index.html>

* Try:
Run with --stacktrace option to get the stack trace. Run with --info or --debug option to
get more log output. Run with --scan to get full insights.

* Get more help at https://help.gradle.org

BUILD FAILED in 1h 43m 50s
30 actionable tasks: 15 executed, 15 up-to-date
Build step 'Execute shell' marked build as failure
Recording test results
Setting GRADLE_4_4_HOME=/home/jenkins/tools/gradle/4.4
Setting GRADLE_4_4_HOME=/home/jenkins/tools/gradle/4.4
Not sending mail to unregistered user wangguoz@gmail.com

Mime
View raw message