kafka-dev mailing list archives

Site index · List index
Message view « Date » · « Thread »
Top « Date » · « Thread »
From Apache Jenkins Server <jenk...@builds.apache.org>
Subject Build failed in Jenkins: kafka-0.10.0-jdk7 #219
Date Sat, 28 Apr 2018 04:38:36 GMT
See <https://builds.apache.org/job/kafka-0.10.0-jdk7/219/display/redirect>

------------------------------------------
[...truncated 228.63 KB...]

org.apache.kafka.streams.kstream.TimeWindowsTest > advanceIntervalMustNotBeZero PASSED

org.apache.kafka.streams.kstream.TimeWindowsTest > windowSizeMustNotBeNegative PASSED

org.apache.kafka.streams.kstream.TimeWindowsTest > advanceIntervalMustNotBeNegative PASSED

org.apache.kafka.streams.kstream.TimeWindowsTest > advanceIntervalMustNotBeLargerThanWindowSize
PASSED

org.apache.kafka.streams.kstream.TimeWindowsTest > windowsForTumblingWindows PASSED

org.apache.kafka.streams.kstream.TimeWindowsTest > windowsForHoppingWindows PASSED

org.apache.kafka.streams.kstream.TimeWindowsTest > windowsForBarelyOverlappingHoppingWindows
PASSED

org.apache.kafka.streams.kstream.JoinWindowsTest > afterBelowLower PASSED

org.apache.kafka.streams.kstream.JoinWindowsTest > nameMustNotBeEmpty PASSED

org.apache.kafka.streams.kstream.JoinWindowsTest > beforeOverUpper PASSED

org.apache.kafka.streams.kstream.JoinWindowsTest > nameMustNotBeNull PASSED

org.apache.kafka.streams.kstream.JoinWindowsTest > shouldHaveSaneEqualsAndHashCode PASSED

org.apache.kafka.streams.kstream.JoinWindowsTest > validWindows PASSED

org.apache.kafka.streams.kstream.JoinWindowsTest > timeDifferenceMustNotBeNegative PASSED

org.apache.kafka.streams.kstream.UnlimitedWindowsTest > nameMustNotBeEmpty PASSED

org.apache.kafka.streams.kstream.UnlimitedWindowsTest > startTimeMustNotBeNegative PASSED

org.apache.kafka.streams.kstream.UnlimitedWindowsTest > shouldIncludeRecordsThatHappenedOnWindowStart
PASSED

org.apache.kafka.streams.kstream.UnlimitedWindowsTest > nameMustNotBeNull PASSED

org.apache.kafka.streams.kstream.UnlimitedWindowsTest > startTimeCanBeZero PASSED

org.apache.kafka.streams.kstream.UnlimitedWindowsTest > shouldIncludeRecordsThatHappenedAfterWindowStart
PASSED

org.apache.kafka.streams.kstream.UnlimitedWindowsTest > shouldExcludeRecordsThatHappenedBeforeWindowStart
PASSED

org.apache.kafka.streams.kstream.KStreamBuilderTest > testMerge PASSED

org.apache.kafka.streams.kstream.KStreamBuilderTest > testFrom PASSED

org.apache.kafka.streams.kstream.KStreamBuilderTest > testNewName PASSED

org.apache.kafka.streams.processor.internals.StreamTaskTest > testProcessOrder PASSED

org.apache.kafka.streams.processor.internals.StreamTaskTest > testPauseResume PASSED

org.apache.kafka.streams.processor.internals.StreamTaskTest > testMaybePunctuate PASSED

org.apache.kafka.streams.processor.internals.ProcessorStateManagerTest > testRegisterNonPersistentStore
PASSED

org.apache.kafka.streams.processor.internals.ProcessorStateManagerTest > testLockStateDirectory
PASSED

org.apache.kafka.streams.processor.internals.ProcessorStateManagerTest > testGetStore PASSED

org.apache.kafka.streams.processor.internals.ProcessorStateManagerTest > testClose PASSED

org.apache.kafka.streams.processor.internals.ProcessorStateManagerTest > testChangeLogOffsets
PASSED

org.apache.kafka.streams.processor.internals.ProcessorStateManagerTest > testRegisterPersistentStore
PASSED

org.apache.kafka.streams.processor.internals.ProcessorStateManagerTest > testNoTopic PASSED

org.apache.kafka.streams.processor.internals.RecordCollectorTest > testSpecificPartition
PASSED

org.apache.kafka.streams.processor.internals.RecordCollectorTest > testStreamPartitioner
PASSED

org.apache.kafka.streams.processor.internals.PartitionGroupTest > testTimeTracking PASSED

org.apache.kafka.streams.processor.internals.StreamPartitionAssignorTest > testAssignWithStandbyReplicas
PASSED

org.apache.kafka.streams.processor.internals.StreamPartitionAssignorTest > testAssignWithNewTasks
PASSED

org.apache.kafka.streams.processor.internals.StreamPartitionAssignorTest > testAssignWithStates
PASSED

org.apache.kafka.streams.processor.internals.StreamPartitionAssignorTest > testAssignBasic
PASSED

org.apache.kafka.streams.processor.internals.StreamPartitionAssignorTest > testOnAssignment
PASSED

org.apache.kafka.streams.processor.internals.StreamPartitionAssignorTest > testSubscription
PASSED

org.apache.kafka.streams.processor.internals.StreamPartitionAssignorTest > testAssignWithInternalTopics
PASSED

org.apache.kafka.streams.processor.internals.ProcessorTopologyTest > testDrivingMultiplexingTopology
PASSED

org.apache.kafka.streams.processor.internals.ProcessorTopologyTest > testDrivingStatefulTopology
PASSED

org.apache.kafka.streams.processor.internals.ProcessorTopologyTest > testDrivingSimpleTopology
PASSED

org.apache.kafka.streams.processor.internals.ProcessorTopologyTest > testTopologyMetadata
PASSED

org.apache.kafka.streams.processor.internals.ProcessorTopologyTest > testDrivingMultiplexByNameTopology
PASSED

org.apache.kafka.streams.processor.internals.StreamThreadTest > testInjectClients PASSED

org.apache.kafka.streams.processor.internals.StreamThreadTest > testMaybeCommit PASSED

org.apache.kafka.streams.processor.internals.StreamThreadTest > testPartitionAssignmentChange
PASSED

org.apache.kafka.streams.processor.internals.StreamThreadTest > testMaybeClean PASSED

org.apache.kafka.streams.processor.internals.MinTimestampTrackerTest > testTracking PASSED

org.apache.kafka.streams.processor.internals.RecordQueueTest > testTimeTracking PASSED

org.apache.kafka.streams.processor.internals.QuickUnionTest > testUnite PASSED

org.apache.kafka.streams.processor.internals.QuickUnionTest > testUniteMany PASSED

org.apache.kafka.streams.processor.internals.assignment.SubscriptionInfoTest > testEncodeDecode
PASSED

org.apache.kafka.streams.processor.internals.assignment.AssginmentInfoTest > testEncodeDecode
PASSED

org.apache.kafka.streams.processor.internals.assignment.TaskAssignorTest > testStickiness
PASSED

org.apache.kafka.streams.processor.internals.assignment.TaskAssignorTest > testAssignWithStandby
PASSED

org.apache.kafka.streams.processor.internals.assignment.TaskAssignorTest > testAssignWithoutStandby
PASSED

org.apache.kafka.streams.processor.internals.StandbyTaskTest > testStorePartitions PASSED

org.apache.kafka.streams.processor.internals.StandbyTaskTest > testUpdateKTable PASSED

org.apache.kafka.streams.processor.internals.StandbyTaskTest > testUpdateNonPersistentStore
PASSED

org.apache.kafka.streams.processor.internals.StandbyTaskTest > testUpdate PASSED

org.apache.kafka.streams.processor.internals.PunctuationQueueTest > testPunctuationInterval
PASSED

org.apache.kafka.streams.processor.DefaultPartitionGrouperTest > testGrouping PASSED

org.apache.kafka.streams.processor.TopologyBuilderTest > testSourceTopics PASSED

org.apache.kafka.streams.processor.TopologyBuilderTest > testAddSinkWithSameName PASSED

org.apache.kafka.streams.processor.TopologyBuilderTest > testAddSinkWithSelfParent PASSED

org.apache.kafka.streams.processor.TopologyBuilderTest > testAddProcessorWithSelfParent
PASSED

org.apache.kafka.streams.processor.TopologyBuilderTest > testAddStateStoreWithSink PASSED

org.apache.kafka.streams.processor.TopologyBuilderTest > testTopicGroups PASSED

org.apache.kafka.streams.processor.TopologyBuilderTest > testBuild PASSED

org.apache.kafka.streams.processor.TopologyBuilderTest > testAddStateStoreWithSource PASSED

org.apache.kafka.streams.processor.TopologyBuilderTest > testAddSourceWithSameName PASSED

org.apache.kafka.streams.processor.TopologyBuilderTest > testAddProcessorWithSameName PASSED

org.apache.kafka.streams.processor.TopologyBuilderTest > testAddSourceWithSameTopic PASSED

org.apache.kafka.streams.processor.TopologyBuilderTest > testTopicGroupsByStateStore PASSED

org.apache.kafka.streams.processor.TopologyBuilderTest > testAddStateStoreWithDuplicates
PASSED

org.apache.kafka.streams.processor.TopologyBuilderTest > testAddSinkWithWrongParent PASSED

org.apache.kafka.streams.processor.TopologyBuilderTest > testAddSinkConnectedWithMultipleParent
PASSED

org.apache.kafka.streams.processor.TopologyBuilderTest > testAddProcessorWithWrongParent
PASSED

org.apache.kafka.streams.processor.TopologyBuilderTest > testAddStateStore PASSED

org.apache.kafka.streams.processor.TopologyBuilderTest > testAddSinkConnectedWithParent
PASSED

org.apache.kafka.streams.processor.TopologyBuilderTest > testAddStateStoreWithNonExistingProcessor
PASSED

org.apache.kafka.streams.state.internals.InMemoryKeyValueStoreTest > testPutIfAbsent PASSED

org.apache.kafka.streams.state.internals.InMemoryKeyValueStoreTest > testRestoreWithDefaultSerdes
PASSED

org.apache.kafka.streams.state.internals.InMemoryKeyValueStoreTest > testRestore PASSED

org.apache.kafka.streams.state.internals.InMemoryKeyValueStoreTest > testPutGetRange PASSED

org.apache.kafka.streams.state.internals.InMemoryKeyValueStoreTest > testPutGetRangeWithDefaultSerdes
PASSED

org.apache.kafka.streams.state.internals.StoreChangeLoggerTest > testAddRemove PASSED

org.apache.kafka.streams.state.internals.RocksDBKeyValueStoreTest > testPutIfAbsent PASSED

org.apache.kafka.streams.state.internals.RocksDBKeyValueStoreTest > testRestoreWithDefaultSerdes
PASSED

org.apache.kafka.streams.state.internals.RocksDBKeyValueStoreTest > testRestore PASSED

org.apache.kafka.streams.state.internals.RocksDBKeyValueStoreTest > testPutGetRange PASSED

org.apache.kafka.streams.state.internals.RocksDBKeyValueStoreTest > testPutGetRangeWithDefaultSerdes
PASSED

org.apache.kafka.streams.state.internals.OffsetCheckpointTest > testReadWrite PASSED

org.apache.kafka.streams.state.internals.RocksDBWindowStoreTest > testPutAndFetch PASSED

org.apache.kafka.streams.state.internals.RocksDBWindowStoreTest > testPutAndFetchBefore
PASSED

org.apache.kafka.streams.state.internals.RocksDBWindowStoreTest > testInitialLoading PASSED

org.apache.kafka.streams.state.internals.RocksDBWindowStoreTest > testRestore PASSED

org.apache.kafka.streams.state.internals.RocksDBWindowStoreTest > testRolling PASSED

org.apache.kafka.streams.state.internals.RocksDBWindowStoreTest > testSegmentMaintenance
PASSED

org.apache.kafka.streams.state.internals.RocksDBWindowStoreTest > testPutSameKeyTimestamp
PASSED

org.apache.kafka.streams.state.internals.RocksDBWindowStoreTest > testPutAndFetchAfter
PASSED

org.apache.kafka.streams.state.internals.InMemoryLRUCacheStoreTest > testEvict PASSED

org.apache.kafka.streams.state.internals.InMemoryLRUCacheStoreTest > testPutIfAbsent PASSED

org.apache.kafka.streams.state.internals.InMemoryLRUCacheStoreTest > testRestoreWithDefaultSerdes
PASSED

org.apache.kafka.streams.state.internals.InMemoryLRUCacheStoreTest > testRestore PASSED

org.apache.kafka.streams.state.internals.InMemoryLRUCacheStoreTest > testPutGetRange PASSED

org.apache.kafka.streams.state.internals.InMemoryLRUCacheStoreTest > testPutGetRangeWithDefaultSerdes
PASSED
pure virtual method called
terminate called without an active exception
:streams:test FAILED

FAILURE: Build failed with an exception.

* What went wrong:
Execution failed for task ':streams:test'.
> Process 'Gradle Test Executor 4' finished with non-zero exit value 134

* Try:
Run with --stacktrace option to get the stack trace. Run with --info or --debug option to
get more log output.

BUILD FAILED

Total time: 1 hrs 5 mins 14.583 secs
Build step 'Execute shell' marked build as failure
Recording test results
ERROR: No tool found matching GRADLE_2_4_RC_2_HOME
Setting GRADLE_4_4_HOME=/home/jenkins/tools/gradle/4.4
ERROR: No tool found matching GRADLE_2_4_RC_2_HOME
Setting GRADLE_4_4_HOME=/home/jenkins/tools/gradle/4.4
Not sending mail to unregistered user ismael@juma.me.uk

Mime
View raw message