kafka-dev mailing list archives

Site index · List index
Message view « Date » · « Thread »
Top « Date » · « Thread »
From Apache Jenkins Server <jenk...@builds.apache.org>
Subject Build failed in Jenkins: kafka-trunk-jdk9 #467
Date Tue, 13 Mar 2018 03:23:44 GMT
See <https://builds.apache.org/job/kafka-trunk-jdk9/467/display/redirect?page=changes>

Changes:

[wangguoz] MINOR: Fix incorrect JavaDoc (type mismatch) (#4632)

------------------------------------------
[...truncated 1.48 MB...]
kafka.log.BrokerCompressionTest > testBrokerSideCompression[17] STARTED

kafka.log.BrokerCompressionTest > testBrokerSideCompression[17] PASSED

kafka.log.BrokerCompressionTest > testBrokerSideCompression[18] STARTED

kafka.log.BrokerCompressionTest > testBrokerSideCompression[18] PASSED

kafka.log.BrokerCompressionTest > testBrokerSideCompression[19] STARTED

kafka.log.BrokerCompressionTest > testBrokerSideCompression[19] PASSED

kafka.log.LogCleanerIntegrationTest > cleanerConfigUpdateTest[0] STARTED

kafka.log.LogCleanerIntegrationTest > cleanerConfigUpdateTest[0] PASSED

kafka.log.LogCleanerIntegrationTest > testCleansCombinedCompactAndDeleteTopic[0] STARTED

kafka.log.LogCleanerIntegrationTest > testCleansCombinedCompactAndDeleteTopic[0] PASSED

kafka.log.LogCleanerIntegrationTest > testCleaningNestedMessagesWithMultipleVersions[0]
STARTED

kafka.log.LogCleanerIntegrationTest > testCleaningNestedMessagesWithMultipleVersions[0]
PASSED

kafka.log.LogCleanerIntegrationTest > cleanerTest[0] STARTED

kafka.log.LogCleanerIntegrationTest > cleanerTest[0] PASSED

kafka.log.LogCleanerIntegrationTest > testCleanerWithMessageFormatV0[0] STARTED

kafka.log.LogCleanerIntegrationTest > testCleanerWithMessageFormatV0[0] PASSED

kafka.log.LogCleanerIntegrationTest > cleanerConfigUpdateTest[1] STARTED

kafka.log.LogCleanerIntegrationTest > cleanerConfigUpdateTest[1] PASSED

kafka.log.LogCleanerIntegrationTest > testCleansCombinedCompactAndDeleteTopic[1] STARTED

kafka.log.LogCleanerIntegrationTest > testCleansCombinedCompactAndDeleteTopic[1] PASSED

kafka.log.LogCleanerIntegrationTest > testCleaningNestedMessagesWithMultipleVersions[1]
STARTED

kafka.log.LogCleanerIntegrationTest > testCleaningNestedMessagesWithMultipleVersions[1]
PASSED

kafka.log.LogCleanerIntegrationTest > cleanerTest[1] STARTED

kafka.log.LogCleanerIntegrationTest > cleanerTest[1] PASSED

kafka.log.LogCleanerIntegrationTest > testCleanerWithMessageFormatV0[1] STARTED

kafka.log.LogCleanerIntegrationTest > testCleanerWithMessageFormatV0[1] PASSED

kafka.log.LogCleanerIntegrationTest > cleanerConfigUpdateTest[2] STARTED

kafka.log.LogCleanerIntegrationTest > cleanerConfigUpdateTest[2] PASSED

kafka.log.LogCleanerIntegrationTest > testCleansCombinedCompactAndDeleteTopic[2] STARTED

kafka.log.LogCleanerIntegrationTest > testCleansCombinedCompactAndDeleteTopic[2] PASSED

kafka.log.LogCleanerIntegrationTest > testCleaningNestedMessagesWithMultipleVersions[2]
STARTED

kafka.log.LogCleanerIntegrationTest > testCleaningNestedMessagesWithMultipleVersions[2]
PASSED

kafka.log.LogCleanerIntegrationTest > cleanerTest[2] STARTED

kafka.log.LogCleanerIntegrationTest > cleanerTest[2] PASSED

kafka.log.LogCleanerIntegrationTest > testCleanerWithMessageFormatV0[2] STARTED

kafka.log.LogCleanerIntegrationTest > testCleanerWithMessageFormatV0[2] PASSED

kafka.log.LogCleanerIntegrationTest > cleanerConfigUpdateTest[3] STARTED

kafka.log.LogCleanerIntegrationTest > cleanerConfigUpdateTest[3] PASSED

kafka.log.LogCleanerIntegrationTest > testCleansCombinedCompactAndDeleteTopic[3] STARTED

kafka.log.LogCleanerIntegrationTest > testCleansCombinedCompactAndDeleteTopic[3] PASSED

kafka.log.LogCleanerIntegrationTest > testCleaningNestedMessagesWithMultipleVersions[3]
STARTED

kafka.log.LogCleanerIntegrationTest > testCleaningNestedMessagesWithMultipleVersions[3]
PASSED

kafka.log.LogCleanerIntegrationTest > cleanerTest[3] STARTED

kafka.log.LogCleanerIntegrationTest > cleanerTest[3] PASSED

kafka.log.LogCleanerIntegrationTest > testCleanerWithMessageFormatV0[3] STARTED

kafka.log.LogCleanerIntegrationTest > testCleanerWithMessageFormatV0[3] PASSED

kafka.log.ProducerStateManagerTest > testCoordinatorFencing STARTED

kafka.log.ProducerStateManagerTest > testCoordinatorFencing PASSED

kafka.log.ProducerStateManagerTest > testTruncate STARTED

kafka.log.ProducerStateManagerTest > testTruncate PASSED

kafka.log.ProducerStateManagerTest > testLoadFromTruncatedSnapshotFile STARTED

kafka.log.ProducerStateManagerTest > testLoadFromTruncatedSnapshotFile PASSED

kafka.log.ProducerStateManagerTest > testRemoveExpiredPidsOnReload STARTED

kafka.log.ProducerStateManagerTest > testRemoveExpiredPidsOnReload PASSED

kafka.log.ProducerStateManagerTest > testOutOfSequenceAfterControlRecordEpochBump STARTED

kafka.log.ProducerStateManagerTest > testOutOfSequenceAfterControlRecordEpochBump PASSED

kafka.log.ProducerStateManagerTest > testFirstUnstableOffsetAfterTruncation STARTED

kafka.log.ProducerStateManagerTest > testFirstUnstableOffsetAfterTruncation PASSED

kafka.log.ProducerStateManagerTest > testTakeSnapshot STARTED

kafka.log.ProducerStateManagerTest > testTakeSnapshot PASSED

kafka.log.ProducerStateManagerTest > testDeleteSnapshotsBefore STARTED

kafka.log.ProducerStateManagerTest > testDeleteSnapshotsBefore PASSED

kafka.log.ProducerStateManagerTest > testNonMatchingTxnFirstOffsetMetadataNotCached STARTED

kafka.log.ProducerStateManagerTest > testNonMatchingTxnFirstOffsetMetadataNotCached PASSED

kafka.log.ProducerStateManagerTest > testFirstUnstableOffsetAfterEviction STARTED

kafka.log.ProducerStateManagerTest > testFirstUnstableOffsetAfterEviction PASSED

kafka.log.ProducerStateManagerTest > testNoValidationOnFirstEntryWhenLoadingLog STARTED

kafka.log.ProducerStateManagerTest > testNoValidationOnFirstEntryWhenLoadingLog PASSED

kafka.log.ProducerStateManagerTest > testLoadFromEmptySnapshotFile STARTED

kafka.log.ProducerStateManagerTest > testLoadFromEmptySnapshotFile PASSED

kafka.log.ProducerStateManagerTest > testProducersWithOngoingTransactionsDontExpire STARTED

kafka.log.ProducerStateManagerTest > testProducersWithOngoingTransactionsDontExpire PASSED

kafka.log.ProducerStateManagerTest > testBasicIdMapping STARTED

kafka.log.ProducerStateManagerTest > testBasicIdMapping PASSED

kafka.log.ProducerStateManagerTest > updateProducerTransactionState STARTED

kafka.log.ProducerStateManagerTest > updateProducerTransactionState PASSED

kafka.log.ProducerStateManagerTest > testRecoverFromSnapshot STARTED

kafka.log.ProducerStateManagerTest > testRecoverFromSnapshot PASSED

kafka.log.ProducerStateManagerTest > testSequenceNotValidatedForGroupMetadataTopic STARTED

kafka.log.ProducerStateManagerTest > testSequenceNotValidatedForGroupMetadataTopic PASSED

kafka.log.ProducerStateManagerTest > testLoadFromSnapshotRemovesNonRetainedProducers STARTED

kafka.log.ProducerStateManagerTest > testLoadFromSnapshotRemovesNonRetainedProducers PASSED

kafka.log.ProducerStateManagerTest > testFirstUnstableOffset STARTED

kafka.log.ProducerStateManagerTest > testFirstUnstableOffset PASSED

kafka.log.ProducerStateManagerTest > testTxnFirstOffsetMetadataCached STARTED

kafka.log.ProducerStateManagerTest > testTxnFirstOffsetMetadataCached PASSED

kafka.log.ProducerStateManagerTest > testCoordinatorFencedAfterReload STARTED

kafka.log.ProducerStateManagerTest > testCoordinatorFencedAfterReload PASSED

kafka.log.ProducerStateManagerTest > testControlRecordBumpsEpoch STARTED

kafka.log.ProducerStateManagerTest > testControlRecordBumpsEpoch PASSED

kafka.log.ProducerStateManagerTest > testAcceptAppendWithoutProducerStateOnReplica STARTED

kafka.log.ProducerStateManagerTest > testAcceptAppendWithoutProducerStateOnReplica PASSED

kafka.log.ProducerStateManagerTest > testLoadFromCorruptSnapshotFile STARTED

kafka.log.ProducerStateManagerTest > testLoadFromCorruptSnapshotFile PASSED

kafka.log.ProducerStateManagerTest > testProducerSequenceWrapAround STARTED

kafka.log.ProducerStateManagerTest > testProducerSequenceWrapAround PASSED

kafka.log.ProducerStateManagerTest > testPidExpirationTimeout STARTED

kafka.log.ProducerStateManagerTest > testPidExpirationTimeout PASSED

kafka.log.ProducerStateManagerTest > testAcceptAppendWithSequenceGapsOnReplica STARTED

kafka.log.ProducerStateManagerTest > testAcceptAppendWithSequenceGapsOnReplica PASSED

kafka.log.ProducerStateManagerTest > testOldEpochForControlRecord STARTED

kafka.log.ProducerStateManagerTest > testOldEpochForControlRecord PASSED

kafka.log.ProducerStateManagerTest > testTruncateAndReloadRemovesOutOfRangeSnapshots STARTED

kafka.log.ProducerStateManagerTest > testTruncateAndReloadRemovesOutOfRangeSnapshots PASSED

kafka.log.ProducerStateManagerTest > testStartOffset STARTED

kafka.log.ProducerStateManagerTest > testStartOffset PASSED

kafka.log.ProducerStateManagerTest > testProducerSequenceInvalidWrapAround STARTED

kafka.log.ProducerStateManagerTest > testProducerSequenceInvalidWrapAround PASSED

kafka.log.ProducerStateManagerTest > testTruncateHead STARTED

kafka.log.ProducerStateManagerTest > testTruncateHead PASSED

kafka.log.ProducerStateManagerTest > testNonTransactionalAppendWithOngoingTransaction STARTED

kafka.log.ProducerStateManagerTest > testNonTransactionalAppendWithOngoingTransaction PASSED

kafka.log.ProducerStateManagerTest > testSkipSnapshotIfOffsetUnchanged STARTED

kafka.log.ProducerStateManagerTest > testSkipSnapshotIfOffsetUnchanged PASSED

1889 tests completed, 1 failed, 6 skipped
:core:test FAILED

FAILURE: Build failed with an exception.

* What went wrong:
Execution failed for task ':core:test'.
> There were failing tests. See the report at: file://<https://builds.apache.org/job/kafka-trunk-jdk9/ws/core/build/reports/tests/test/index.html>

* Try:
Run with --stacktrace option to get the stack trace. Run with --info or --debug option to
get more log output. Run with --scan to get full insights.

* Get more help at https://help.gradle.org

BUILD FAILED in 56m 5s
30 actionable tasks: 15 executed, 15 up-to-date
Build step 'Execute shell' marked build as failure
Recording test results
Setting GRADLE_4_4_HOME=/home/jenkins/tools/gradle/4.4
Setting GRADLE_4_4_HOME=/home/jenkins/tools/gradle/4.4
Not sending mail to unregistered user wangguoz@gmail.com

Mime
View raw message