kafka-dev mailing list archives

Site index · List index
Message view « Date » · « Thread »
Top « Date » · « Thread »
From Apache Jenkins Server <jenk...@builds.apache.org>
Subject Build failed in Jenkins: kafka-trunk-jdk7 #3293
Date Wed, 28 Mar 2018 04:39:05 GMT
See <https://builds.apache.org/job/kafka-trunk-jdk7/3293/display/redirect?page=changes>

Changes:

[github] MINOR: LogCleaner.validateReconfiguration fixes (#4770)

------------------------------------------
Started by an SCM change
[EnvInject] - Loading node environment variables.
Building remotely on H20 (ubuntu xenial) in workspace <https://builds.apache.org/job/kafka-trunk-jdk7/ws/>
Cloning the remote Git repository
Cloning repository https://github.com/apache/kafka.git
 > git init <https://builds.apache.org/job/kafka-trunk-jdk7/ws/> # timeout=10
Fetching upstream changes from https://github.com/apache/kafka.git
 > git --version # timeout=10
 > git fetch --tags --progress https://github.com/apache/kafka.git +refs/heads/*:refs/remotes/origin/*
 > git config remote.origin.url https://github.com/apache/kafka.git # timeout=10
 > git config --add remote.origin.fetch +refs/heads/*:refs/remotes/origin/* # timeout=10
 > git config remote.origin.url https://github.com/apache/kafka.git # timeout=10
Fetching upstream changes from https://github.com/apache/kafka.git
 > git fetch --tags --progress https://github.com/apache/kafka.git +refs/heads/*:refs/remotes/origin/*
 > git rev-parse refs/remotes/origin/trunk^{commit} # timeout=10
 > git rev-parse refs/remotes/origin/origin/trunk^{commit} # timeout=10
Checking out Revision 281dbfd9813603d913a2a0b948547dea7b863be2 (refs/remotes/origin/trunk)
 > git config core.sparsecheckout # timeout=10
 > git checkout -f 281dbfd9813603d913a2a0b948547dea7b863be2
Commit message: "MINOR: LogCleaner.validateReconfiguration fixes (#4770)"
 > git rev-list --no-walk 964693e40d9303d5d754010f03731d2134bae749 # timeout=10
Setting GRADLE_3_5_HOME=/home/jenkins/tools/gradle/3.5
[kafka-trunk-jdk7] $ /bin/bash -xe /tmp/jenkins2187426838719881224.sh
+ rm -rf <https://builds.apache.org/job/kafka-trunk-jdk7/ws/.gradle>
+ /home/jenkins/tools/gradle/3.5/bin/gradle
To honour the JVM settings for this build a new JVM will be forked. Please consider using
the daemon: https://docs.gradle.org/3.5/userguide/gradle_daemon.html.
Daemon will be stopped at the end of the build stopping after processing
Building project 'core' with Scala version 2.11.12
:downloadWrapper

BUILD SUCCESSFUL

Total time: 20.845 secs
Setting GRADLE_3_5_HOME=/home/jenkins/tools/gradle/3.5
[kafka-trunk-jdk7] $ /bin/bash -xe /tmp/jenkins5401660615825300387.sh
+ export 'GRADLE_OPTS=-Xmx1024m -XX:MaxPermSize=256m'
+ GRADLE_OPTS='-Xmx1024m -XX:MaxPermSize=256m'
+ ./gradlew --no-daemon -PmaxParallelForks=1 -PtestLoggingEvents=started,passed,skipped,failed
-PxmlFindBugsReport=true clean testAll
To honour the JVM settings for this build a new JVM will be forked. Please consider using
the daemon: https://docs.gradle.org/4.6/userguide/gradle_daemon.html.
Daemon will be stopped at the end of the build stopping after processing
Building project 'core' with Scala version 2.11.12
:clean UP-TO-DATE
:clients:clean UP-TO-DATE
:connect:clean UP-TO-DATE
:core:clean
:examples:clean UP-TO-DATE
:jmh-benchmarks:clean UP-TO-DATE
:log4j-appender:clean UP-TO-DATE
:streams:clean UP-TO-DATE
:tools:clean UP-TO-DATE
:connect:api:clean UP-TO-DATE
:connect:file:clean UP-TO-DATE
:connect:json:clean UP-TO-DATE
:connect:runtime:clean UP-TO-DATE
:connect:transforms:clean UP-TO-DATE
:streams:examples:clean UP-TO-DATE
:streams:test-utils:clean UP-TO-DATE
:test_core_2_11
Building project 'core' with Scala version 2.11.12
:test_core_2_11 FAILED

FAILURE: Build failed with an exception.

* What went wrong:
Could not determine the dependencies of task ':kafka-trunk-jdk7:clients:compileJava'.
> Could not create service of type AnnotationProcessorDetector using JavaGradleScopeServices.createAnnotationProcessorDetector().

* Try:
Run with --stacktrace option to get the stack trace. Run with --info or --debug option to
get more log output. Run with --scan to get full insights.

* Get more help at https://help.gradle.org

Deprecated Gradle features were used in this build, making it incompatible with Gradle 5.0.
See https://docs.gradle.org/4.6/userguide/command_line_interface.html#sec:command_line_warnings

BUILD FAILED in 14s
17 actionable tasks: 2 executed, 15 up-to-date
Build step 'Execute shell' marked build as failure
[FINDBUGS] Collecting findbugs analysis files...
Setting GRADLE_3_5_HOME=/home/jenkins/tools/gradle/3.5
[FINDBUGS] Searching for all files in <https://builds.apache.org/job/kafka-trunk-jdk7/ws/>
that match the pattern **/build/reports/findbugs/*.xml
[FINDBUGS] No files found. Configuration error?
Setting GRADLE_3_5_HOME=/home/jenkins/tools/gradle/3.5
Setting GRADLE_3_5_HOME=/home/jenkins/tools/gradle/3.5
<Git Blamer> Using GitBlamer to create author and commit information for all warnings.
<Git Blamer> GIT_COMMIT=281dbfd9813603d913a2a0b948547dea7b863be2, workspace=<https://builds.apache.org/job/kafka-trunk-jdk7/ws/>
[FINDBUGS] Computing warning deltas based on reference build #3280
Recording test results
Setting GRADLE_3_5_HOME=/home/jenkins/tools/gradle/3.5
ERROR: Step ?Publish JUnit test result report? failed: No test report files were found. Configuration
error?
Setting GRADLE_3_5_HOME=/home/jenkins/tools/gradle/3.5
Not sending mail to unregistered user ismael@juma.me.uk
Not sending mail to unregistered user github@alasdairhodge.co.uk
Not sending mail to unregistered user wangguoz@gmail.com

Mime
View raw message