kafka-dev mailing list archives

Site index · List index
Message view « Date » · « Thread »
Top « Date » · « Thread »
From Apache Jenkins Server <jenk...@builds.apache.org>
Subject Build failed in Jenkins: kafka-trunk-jdk7 #3239
Date Sat, 10 Mar 2018 00:40:17 GMT
See <https://builds.apache.org/job/kafka-trunk-jdk7/3239/display/redirect?page=changes>

Changes:

[ismael] MINOR: Add PayloadGenerator to Trogdor (#4640)

[jason] KAFKA-6622; Fix performance issue loading consumer offsets (#4661)

[ismael] MINOR: Tag AWS instances with Jenkins build url (#4657)

------------------------------------------
[...truncated 420.73 KB...]
kafka.zk.KafkaZkClientTest > testIsrChangeNotificationsDeletion PASSED

kafka.zk.KafkaZkClientTest > testGetDataAndVersion STARTED

kafka.zk.KafkaZkClientTest > testGetDataAndVersion PASSED

kafka.zk.KafkaZkClientTest > testGetChildren STARTED

kafka.zk.KafkaZkClientTest > testGetChildren PASSED

kafka.zk.KafkaZkClientTest > testSetAndGetConsumerOffset STARTED

kafka.zk.KafkaZkClientTest > testSetAndGetConsumerOffset PASSED

kafka.zk.KafkaZkClientTest > testClusterIdMethods STARTED

kafka.zk.KafkaZkClientTest > testClusterIdMethods PASSED

kafka.zk.KafkaZkClientTest > testEntityConfigManagementMethods STARTED

kafka.zk.KafkaZkClientTest > testEntityConfigManagementMethods PASSED

kafka.zk.KafkaZkClientTest > testUpdateLeaderAndIsr STARTED

kafka.zk.KafkaZkClientTest > testUpdateLeaderAndIsr PASSED

kafka.zk.KafkaZkClientTest > testUpdateBrokerInfo STARTED

kafka.zk.KafkaZkClientTest > testUpdateBrokerInfo PASSED

kafka.zk.KafkaZkClientTest > testCreateRecursive STARTED

kafka.zk.KafkaZkClientTest > testCreateRecursive PASSED

kafka.zk.KafkaZkClientTest > testGetConsumerOffsetNoData STARTED

kafka.zk.KafkaZkClientTest > testGetConsumerOffsetNoData PASSED

kafka.zk.KafkaZkClientTest > testDeleteTopicPathMethods STARTED

kafka.zk.KafkaZkClientTest > testDeleteTopicPathMethods PASSED

kafka.zk.KafkaZkClientTest > testSetTopicPartitionStatesRaw STARTED

kafka.zk.KafkaZkClientTest > testSetTopicPartitionStatesRaw PASSED

kafka.zk.KafkaZkClientTest > testAclManagementMethods STARTED

kafka.zk.KafkaZkClientTest > testAclManagementMethods PASSED

kafka.zk.KafkaZkClientTest > testPreferredReplicaElectionMethods STARTED

kafka.zk.KafkaZkClientTest > testPreferredReplicaElectionMethods PASSED

kafka.zk.KafkaZkClientTest > testPropagateLogDir STARTED

kafka.zk.KafkaZkClientTest > testPropagateLogDir PASSED

kafka.zk.KafkaZkClientTest > testGetDataAndStat STARTED

kafka.zk.KafkaZkClientTest > testGetDataAndStat PASSED

kafka.zk.KafkaZkClientTest > testReassignPartitionsInProgress STARTED

kafka.zk.KafkaZkClientTest > testReassignPartitionsInProgress PASSED

kafka.zk.KafkaZkClientTest > testCreateTopLevelPaths STARTED

kafka.zk.KafkaZkClientTest > testCreateTopLevelPaths PASSED

kafka.zk.KafkaZkClientTest > testIsrChangeNotificationGetters STARTED

kafka.zk.KafkaZkClientTest > testIsrChangeNotificationGetters PASSED

kafka.zk.KafkaZkClientTest > testLogDirEventNotificationsDeletion STARTED

kafka.zk.KafkaZkClientTest > testLogDirEventNotificationsDeletion PASSED

kafka.zk.KafkaZkClientTest > testGetLogConfigs STARTED

kafka.zk.KafkaZkClientTest > testGetLogConfigs PASSED

kafka.zk.KafkaZkClientTest > testBrokerSequenceIdMethods STARTED

kafka.zk.KafkaZkClientTest > testBrokerSequenceIdMethods PASSED

kafka.zk.KafkaZkClientTest > testCreateSequentialPersistentPath STARTED

kafka.zk.KafkaZkClientTest > testCreateSequentialPersistentPath PASSED

kafka.zk.KafkaZkClientTest > testConditionalUpdatePath STARTED

kafka.zk.KafkaZkClientTest > testConditionalUpdatePath PASSED

kafka.zk.KafkaZkClientTest > testDeleteTopicZNode STARTED

kafka.zk.KafkaZkClientTest > testDeleteTopicZNode PASSED

kafka.zk.KafkaZkClientTest > testDeletePath STARTED

kafka.zk.KafkaZkClientTest > testDeletePath PASSED

kafka.zk.KafkaZkClientTest > testGetBrokerMethods STARTED

kafka.zk.KafkaZkClientTest > testGetBrokerMethods PASSED

kafka.zk.KafkaZkClientTest > testCreateTokenChangeNotification STARTED

kafka.zk.KafkaZkClientTest > testCreateTokenChangeNotification PASSED

kafka.zk.KafkaZkClientTest > testGetTopicsAndPartitions STARTED

kafka.zk.KafkaZkClientTest > testGetTopicsAndPartitions PASSED

kafka.zk.KafkaZkClientTest > testRegisterBrokerInfo STARTED

kafka.zk.KafkaZkClientTest > testRegisterBrokerInfo PASSED

kafka.zk.KafkaZkClientTest > testControllerManagementMethods STARTED

kafka.zk.KafkaZkClientTest > testControllerManagementMethods PASSED

kafka.zk.KafkaZkClientTest > testTopicAssignmentMethods STARTED

kafka.zk.KafkaZkClientTest > testTopicAssignmentMethods PASSED

kafka.zk.KafkaZkClientTest > testPropagateIsrChanges STARTED

kafka.zk.KafkaZkClientTest > testPropagateIsrChanges PASSED

kafka.zk.KafkaZkClientTest > testControllerEpochMethods STARTED

kafka.zk.KafkaZkClientTest > testControllerEpochMethods PASSED

kafka.zk.KafkaZkClientTest > testDeleteRecursive STARTED

kafka.zk.KafkaZkClientTest > testDeleteRecursive PASSED

kafka.zk.KafkaZkClientTest > testGetTopicPartitionStates STARTED

kafka.zk.KafkaZkClientTest > testGetTopicPartitionStates PASSED

kafka.zk.KafkaZkClientTest > testCreateConfigChangeNotification STARTED

kafka.zk.KafkaZkClientTest > testCreateConfigChangeNotification PASSED

kafka.zk.KafkaZkClientTest > testDelegationTokenMethods STARTED

kafka.zk.KafkaZkClientTest > testDelegationTokenMethods PASSED

kafka.zk.ZKPathTest > testCreatePersistentSequentialThrowsException STARTED

kafka.zk.ZKPathTest > testCreatePersistentSequentialThrowsException PASSED

kafka.zk.ZKPathTest > testCreatePersistentSequentialExists STARTED

kafka.zk.ZKPathTest > testCreatePersistentSequentialExists PASSED

kafka.zk.ZKPathTest > testCreateEphemeralPathExists STARTED

kafka.zk.ZKPathTest > testCreateEphemeralPathExists PASSED

kafka.zk.ZKPathTest > testCreatePersistentPath STARTED

kafka.zk.ZKPathTest > testCreatePersistentPath PASSED

kafka.zk.ZKPathTest > testMakeSurePersistsPathExistsThrowsException STARTED

kafka.zk.ZKPathTest > testMakeSurePersistsPathExistsThrowsException PASSED

kafka.zk.ZKPathTest > testCreateEphemeralPathThrowsException STARTED

kafka.zk.ZKPathTest > testCreateEphemeralPathThrowsException PASSED

kafka.zk.ZKPathTest > testCreatePersistentPathThrowsException STARTED

kafka.zk.ZKPathTest > testCreatePersistentPathThrowsException PASSED

kafka.zk.ZKPathTest > testMakeSurePersistsPathExists STARTED

kafka.zk.ZKPathTest > testMakeSurePersistsPathExists PASSED

kafka.zk.ZKEphemeralTest > testOverlappingSessions[0] STARTED

kafka.zk.ZKEphemeralTest > testOverlappingSessions[0] PASSED

kafka.zk.ZKEphemeralTest > testEphemeralNodeCleanup[0] STARTED

kafka.zk.ZKEphemeralTest > testEphemeralNodeCleanup[0] PASSED

kafka.zk.ZKEphemeralTest > testZkWatchedEphemeral[0] STARTED

kafka.zk.ZKEphemeralTest > testZkWatchedEphemeral[0] PASSED

kafka.zk.ZKEphemeralTest > testSameSession[0] STARTED

kafka.zk.ZKEphemeralTest > testSameSession[0] PASSED

kafka.zk.ZKEphemeralTest > testOverlappingSessions[1] STARTED

kafka.zk.ZKEphemeralTest > testOverlappingSessions[1] PASSED

kafka.zk.ZKEphemeralTest > testEphemeralNodeCleanup[1] STARTED

kafka.zk.ZKEphemeralTest > testEphemeralNodeCleanup[1] PASSED

kafka.zk.ZKEphemeralTest > testZkWatchedEphemeral[1] STARTED

kafka.zk.ZKEphemeralTest > testZkWatchedEphemeral[1] PASSED

kafka.zk.ZKEphemeralTest > testSameSession[1] STARTED

kafka.zk.ZKEphemeralTest > testSameSession[1] PASSED

1888 tests completed, 1 failed, 6 skipped
:kafka-trunk-jdk7:core:test FAILED
:test_core_2_11 FAILED

FAILURE: Build failed with an exception.

* What went wrong:
Execution failed for task ':kafka-trunk-jdk7:core:test'.
> There were failing tests. See the report at: file://<https://builds.apache.org/job/kafka-trunk-jdk7/ws/core/build/reports/tests/test/index.html>

* Try:
Run with --stacktrace option to get the stack trace. Run with --info or --debug option to
get more log output. Run with --scan to get full insights.

* Get more help at https://help.gradle.org

Deprecated Gradle features were used in this build, making it incompatible with Gradle 5.0.
See https://docs.gradle.org/4.5.1/userguide/command_line_interface.html#sec:command_line_warnings

BUILD FAILED in 1h 40m 48s
17 actionable tasks: 2 executed, 15 up-to-date
Build step 'Execute shell' marked build as failure
[FINDBUGS] Collecting findbugs analysis files...
Setting GRADLE_3_5_HOME=/home/jenkins/tools/gradle/3.5
[FINDBUGS] Searching for all files in <https://builds.apache.org/job/kafka-trunk-jdk7/ws/>
that match the pattern **/build/reports/findbugs/*.xml
[FINDBUGS] Parsing 1 file in <https://builds.apache.org/job/kafka-trunk-jdk7/ws/>
[FINDBUGS] Successfully parsed file <https://builds.apache.org/job/kafka-trunk-jdk7/ws/core/build/reports/findbugs/main.xml>
with 0 unique warnings and 0 duplicates.
Setting GRADLE_3_5_HOME=/home/jenkins/tools/gradle/3.5
Setting GRADLE_3_5_HOME=/home/jenkins/tools/gradle/3.5
<Git Blamer> Using GitBlamer to create author and commit information for all warnings.
<Git Blamer> GIT_COMMIT=fd015b401dcc977b51396f80fab5acdd792ba694, workspace=<https://builds.apache.org/job/kafka-trunk-jdk7/ws/>
[FINDBUGS] Computing warning deltas based on reference build #3238
Recording test results
Setting GRADLE_3_5_HOME=/home/jenkins/tools/gradle/3.5
Setting GRADLE_3_5_HOME=/home/jenkins/tools/gradle/3.5
Not sending mail to unregistered user ismael@juma.me.uk

Mime
View raw message