kafka-dev mailing list archives

Site index · List index
Message view « Date » · « Thread »
Top « Date » · « Thread »
From Apache Jenkins Server <jenk...@builds.apache.org>
Subject Build failed in Jenkins: kafka-trunk-jdk8 #2503
Date Tue, 27 Mar 2018 00:13:10 GMT
See <https://builds.apache.org/job/kafka-trunk-jdk8/2503/display/redirect?page=changes>

Changes:

[wangguoz] MINOR: Fix flaky standby task test (#4767)

------------------------------------------
Started by an SCM change
[EnvInject] - Loading node environment variables.
Building remotely on H20 (ubuntu xenial) in workspace <https://builds.apache.org/job/kafka-trunk-jdk8/ws/>
Cloning the remote Git repository
Cloning repository https://github.com/apache/kafka.git
 > git init <https://builds.apache.org/job/kafka-trunk-jdk8/ws/> # timeout=10
Fetching upstream changes from https://github.com/apache/kafka.git
 > git --version # timeout=10
 > git fetch --tags --progress https://github.com/apache/kafka.git +refs/heads/*:refs/remotes/origin/*
 > git config remote.origin.url https://github.com/apache/kafka.git # timeout=10
 > git config --add remote.origin.fetch +refs/heads/*:refs/remotes/origin/* # timeout=10
 > git config remote.origin.url https://github.com/apache/kafka.git # timeout=10
Fetching upstream changes from https://github.com/apache/kafka.git
 > git fetch --tags --progress https://github.com/apache/kafka.git +refs/heads/*:refs/remotes/origin/*
 > git rev-parse refs/remotes/origin/trunk^{commit} # timeout=10
 > git rev-parse refs/remotes/origin/origin/trunk^{commit} # timeout=10
Checking out Revision f4a39f9b8314847ffc7250f8cee3e87795b0aaeb (refs/remotes/origin/trunk)
 > git config core.sparsecheckout # timeout=10
 > git checkout -f f4a39f9b8314847ffc7250f8cee3e87795b0aaeb
Commit message: "MINOR: Fix flaky standby task test (#4767)"
 > git rev-list --no-walk 3f611044cc55c6633cb64fd86a3ac6274952fa72 # timeout=10
Setting GRADLE_4_4_HOME=/home/jenkins/tools/gradle/4.4
[kafka-trunk-jdk8] $ /bin/bash -xe /tmp/jenkins5969965851527679050.sh
+ rm -rf <https://builds.apache.org/job/kafka-trunk-jdk8/ws/.gradle>
+ /home/jenkins/tools/gradle/4.4/bin/gradle
To honour the JVM settings for this build a new JVM will be forked. Please consider using
the daemon: https://docs.gradle.org/4.4.1/userguide/gradle_daemon.html.
Daemon will be stopped at the end of the build stopping after processing
Download https://repo.maven.apache.org/maven2/org/owasp/dependency-check-gradle/3.1.1/dependency-check-gradle-3.1.1.pom
Download https://jcenter.bintray.com/org/ajoberstar/grgit/1.9.3/grgit-1.9.3.pom
Download https://jcenter.bintray.com/com/github/ben-manes/gradle-versions-plugin/0.17.0/gradle-versions-plugin-0.17.0.pom
Download https://jcenter.bintray.com/com/github/jengelman/gradle/plugins/shadow/2.0.2/shadow-2.0.2.pom
Download https://repo.maven.apache.org/maven2/org/owasp/dependency-check-utils/3.1.1/dependency-check-utils-3.1.1.pom
Download https://repo.maven.apache.org/maven2/org/owasp/dependency-check-core/3.1.1/dependency-check-core-3.1.1.pom
Download https://repo.maven.apache.org/maven2/org/owasp/dependency-check-parent/3.1.1/dependency-check-parent-3.1.1.pom
Download https://repo.maven.apache.org/maven2/com/vdurmont/semver4j/2.1.0/semver4j-2.1.0.pom
Download https://repo.maven.apache.org/maven2/org/jsoup/jsoup/1.11.2/jsoup-1.11.2.pom
Download https://repo.maven.apache.org/maven2/org/apache/lucene/lucene-queryparser/5.5.5/lucene-queryparser-5.5.5.pom
Download https://repo.maven.apache.org/maven2/org/apache/lucene/lucene-analyzers-common/5.5.5/lucene-analyzers-common-5.5.5.pom
Download https://repo.maven.apache.org/maven2/com/google/code/gson/gson/2.8.2/gson-2.8.2.pom
Download https://repo.maven.apache.org/maven2/org/apache/lucene/lucene-core/5.5.5/lucene-core-5.5.5.pom
Download https://repo.maven.apache.org/maven2/com/sun/mail/mailapi/1.6.0/mailapi-1.6.0.pom
Download https://repo.maven.apache.org/maven2/org/apache/lucene/lucene-parent/5.5.5/lucene-parent-5.5.5.pom
Download https://repo.maven.apache.org/maven2/com/google/code/gson/gson-parent/2.8.2/gson-parent-2.8.2.pom
Download https://repo.maven.apache.org/maven2/com/sun/mail/all/1.6.0/all-1.6.0.pom
Download https://repo.maven.apache.org/maven2/org/apache/lucene/lucene-solr-grandparent/5.5.5/lucene-solr-grandparent-5.5.5.pom
Download https://repo.maven.apache.org/maven2/org/apache/lucene/lucene-sandbox/5.5.5/lucene-sandbox-5.5.5.pom
Download https://repo.maven.apache.org/maven2/org/apache/lucene/lucene-queries/5.5.5/lucene-queries-5.5.5.pom
Download https://repo.maven.apache.org/maven2/org/owasp/dependency-check-utils/3.1.1/dependency-check-utils-3.1.1.jar
Download https://repo.maven.apache.org/maven2/org/apache/lucene/lucene-analyzers-common/5.5.5/lucene-analyzers-common-5.5.5.jar
Download https://repo.maven.apache.org/maven2/org/owasp/dependency-check-gradle/3.1.1/dependency-check-gradle-3.1.1.jar
Download https://repo.maven.apache.org/maven2/org/apache/lucene/lucene-queryparser/5.5.5/lucene-queryparser-5.5.5.jar
Download https://repo.maven.apache.org/maven2/com/vdurmont/semver4j/2.1.0/semver4j-2.1.0.jar
Download https://repo.maven.apache.org/maven2/org/jsoup/jsoup/1.11.2/jsoup-1.11.2.jar
Download https://repo.maven.apache.org/maven2/org/apache/lucene/lucene-core/5.5.5/lucene-core-5.5.5.jar
Download https://repo.maven.apache.org/maven2/com/sun/mail/mailapi/1.6.0/mailapi-1.6.0.jar
Download https://repo.maven.apache.org/maven2/org/apache/lucene/lucene-sandbox/5.5.5/lucene-sandbox-5.5.5.jar
Download https://repo.maven.apache.org/maven2/com/google/code/gson/gson/2.8.2/gson-2.8.2.jar
Download https://repo.maven.apache.org/maven2/org/owasp/dependency-check-core/3.1.1/dependency-check-core-3.1.1.jar
Download https://repo.maven.apache.org/maven2/org/apache/lucene/lucene-queries/5.5.5/lucene-queries-5.5.5.jar
Download https://jcenter.bintray.com/com/github/ben-manes/gradle-versions-plugin/0.17.0/gradle-versions-plugin-0.17.0.jar
Download https://jcenter.bintray.com/org/ajoberstar/grgit/1.9.3/grgit-1.9.3.jar
Download https://jcenter.bintray.com/com/github/jengelman/gradle/plugins/shadow/2.0.2/shadow-2.0.2.jar
Building project 'core' with Scala version 2.11.12
Download https://repo.maven.apache.org/maven2/org/scoverage/scalac-scoverage-plugin_2.11/1.3.1/scalac-scoverage-plugin_2.11-1.3.1.pom
Download https://repo.maven.apache.org/maven2/org/scoverage/scalac-scoverage-runtime_2.11/1.3.1/scalac-scoverage-runtime_2.11-1.3.1.pom
Download https://repo.maven.apache.org/maven2/org/scoverage/scalac-scoverage-plugin_2.11/1.3.1/scalac-scoverage-plugin_2.11-1.3.1.jar
Download https://repo.maven.apache.org/maven2/org/scoverage/scalac-scoverage-runtime_2.11/1.3.1/scalac-scoverage-runtime_2.11-1.3.1.jar
:downloadWrapper

BUILD SUCCESSFUL in 14s
1 actionable task: 1 executed
Setting GRADLE_4_4_HOME=/home/jenkins/tools/gradle/4.4
[kafka-trunk-jdk8] $ /bin/bash -xe /tmp/jenkins5571881948268800987.sh
+ export GRADLE_OPTS=-Xmx1024m
+ GRADLE_OPTS=-Xmx1024m
+ ./gradlew --no-daemon -PmaxParallelForks=1 -PtestLoggingEvents=started,passed,skipped,failed
-PxmlFindBugsReport=true clean testAll
Downloading https://services.gradle.org/distributions/gradle-4.6-bin.zip
......................................................................
Unzipping /home/jenkins/.gradle/wrapper/dists/gradle-4.6-bin/4jp4stjndanmxuerzfseyb6wo/gradle-4.6-bin.zip
to /home/jenkins/.gradle/wrapper/dists/gradle-4.6-bin/4jp4stjndanmxuerzfseyb6wo
Set executable permissions for: /home/jenkins/.gradle/wrapper/dists/gradle-4.6-bin/4jp4stjndanmxuerzfseyb6wo/gradle-4.6/bin/gradle
To honour the JVM settings for this build a new JVM will be forked. Please consider using
the daemon: https://docs.gradle.org/4.6/userguide/gradle_daemon.html.
Daemon will be stopped at the end of the build stopping after processing
Building project 'core' with Scala version 2.11.12
:clean UP-TO-DATE
:clients:clean UP-TO-DATE
:connect:clean UP-TO-DATE
:core:clean
:examples:clean UP-TO-DATE
:jmh-benchmarks:clean UP-TO-DATE
:log4j-appender:clean UP-TO-DATE
:streams:clean UP-TO-DATE
:tools:clean UP-TO-DATE
:connect:api:clean UP-TO-DATE
:connect:file:clean UP-TO-DATE
:connect:json:clean UP-TO-DATE
:connect:runtime:clean UP-TO-DATE
:connect:transforms:clean UP-TO-DATE
:streams:examples:clean UP-TO-DATE
:streams:test-utils:clean UP-TO-DATE
:test_core_2_11
Building project 'core' with Scala version 2.11.12
:test_core_2_11 FAILED

FAILURE: Build failed with an exception.

* What went wrong:
Could not determine the dependencies of task ':kafka-trunk-jdk8:clients:compileJava'.
> Could not create service of type AnnotationProcessorDetector using JavaGradleScopeServices.createAnnotationProcessorDetector().

* Try:
Run with --stacktrace option to get the stack trace. Run with --info or --debug option to
get more log output. Run with --scan to get full insights.

* Get more help at https://help.gradle.org

BUILD FAILED in 19s
17 actionable tasks: 2 executed, 15 up-to-date
Build step 'Execute shell' marked build as failure
[FINDBUGS] Collecting findbugs analysis files...
Setting GRADLE_4_4_HOME=/home/jenkins/tools/gradle/4.4
[FINDBUGS] Searching for all files in <https://builds.apache.org/job/kafka-trunk-jdk8/ws/>
that match the pattern **/build/reports/findbugs/*.xml
[FINDBUGS] No files found. Configuration error?
Setting GRADLE_4_4_HOME=/home/jenkins/tools/gradle/4.4
Setting GRADLE_4_4_HOME=/home/jenkins/tools/gradle/4.4
<Git Blamer> Using GitBlamer to create author and commit information for all warnings.
<Git Blamer> GIT_COMMIT=f4a39f9b8314847ffc7250f8cee3e87795b0aaeb, workspace=<https://builds.apache.org/job/kafka-trunk-jdk8/ws/>
[FINDBUGS] Computing warning deltas based on reference build #2477
Recording test results
Setting GRADLE_4_4_HOME=/home/jenkins/tools/gradle/4.4
ERROR: Step ?Publish JUnit test result report? failed: No test report files were found. Configuration
error?
Setting GRADLE_4_4_HOME=/home/jenkins/tools/gradle/4.4
Not sending mail to unregistered user ismael@juma.me.uk
Not sending mail to unregistered user rajinisivaram@googlemail.com
Not sending mail to unregistered user github@alasdairhodge.co.uk
Not sending mail to unregistered user wangguoz@gmail.com

Mime
View raw message