kafka-dev mailing list archives

Site index · List index
Message view « Date » · « Thread »
Top « Date » · « Thread »
From Apache Jenkins Server <jenk...@builds.apache.org>
Subject Build failed in Jenkins: kafka-trunk-jdk8 #2482
Date Fri, 16 Mar 2018 22:27:22 GMT
See <https://builds.apache.org/job/kafka-trunk-jdk8/2482/display/redirect?page=changes>

Changes:

[rajinisivaram] MINOR: Trogdor should not assume an agent co-located with the controller

------------------------------------------
[...truncated 3.52 MB...]

kafka.utils.json.JsonValueTest > testAsJsonObjectOption PASSED

kafka.utils.json.JsonValueTest > testAsJsonArrayOption STARTED

kafka.utils.json.JsonValueTest > testAsJsonArrayOption PASSED

kafka.utils.json.JsonValueTest > testAsJsonArray STARTED

kafka.utils.json.JsonValueTest > testAsJsonArray PASSED

kafka.utils.json.JsonValueTest > testJsonValueHashCode STARTED

kafka.utils.json.JsonValueTest > testJsonValueHashCode PASSED

kafka.utils.json.JsonValueTest > testDecodeInt STARTED

kafka.utils.json.JsonValueTest > testDecodeInt PASSED

kafka.utils.json.JsonValueTest > testDecodeMap STARTED

kafka.utils.json.JsonValueTest > testDecodeMap PASSED

kafka.utils.json.JsonValueTest > testDecodeSeq STARTED

kafka.utils.json.JsonValueTest > testDecodeSeq PASSED

kafka.utils.json.JsonValueTest > testJsonObjectGet STARTED

kafka.utils.json.JsonValueTest > testJsonObjectGet PASSED

kafka.utils.json.JsonValueTest > testJsonValueEquals STARTED

kafka.utils.json.JsonValueTest > testJsonValueEquals PASSED

kafka.utils.json.JsonValueTest > testJsonArrayIterator STARTED

kafka.utils.json.JsonValueTest > testJsonArrayIterator PASSED

kafka.utils.json.JsonValueTest > testJsonObjectApply STARTED

kafka.utils.json.JsonValueTest > testJsonObjectApply PASSED

kafka.utils.json.JsonValueTest > testDecodeBoolean STARTED

kafka.utils.json.JsonValueTest > testDecodeBoolean PASSED

kafka.utils.PasswordEncoderTest > testEncoderConfigChange STARTED

kafka.utils.PasswordEncoderTest > testEncoderConfigChange PASSED

kafka.utils.PasswordEncoderTest > testEncodeDecodeAlgorithms STARTED

kafka.utils.PasswordEncoderTest > testEncodeDecodeAlgorithms PASSED

kafka.utils.PasswordEncoderTest > testEncodeDecode STARTED

kafka.utils.PasswordEncoderTest > testEncodeDecode PASSED

kafka.producer.AsyncProducerTest > testFailedSendRetryLogic STARTED

kafka.producer.AsyncProducerTest > testFailedSendRetryLogic PASSED

kafka.producer.AsyncProducerTest > testQueueTimeExpired STARTED

kafka.producer.AsyncProducerTest > testQueueTimeExpired PASSED

kafka.producer.AsyncProducerTest > testPartitionAndCollateEvents STARTED

kafka.producer.AsyncProducerTest > testPartitionAndCollateEvents PASSED

kafka.producer.AsyncProducerTest > testBatchSize STARTED

kafka.producer.AsyncProducerTest > testBatchSize PASSED

kafka.producer.AsyncProducerTest > testSerializeEvents STARTED

kafka.producer.AsyncProducerTest > testSerializeEvents PASSED

kafka.producer.AsyncProducerTest > testProducerQueueSize STARTED

kafka.producer.AsyncProducerTest > testProducerQueueSize PASSED

kafka.producer.AsyncProducerTest > testRandomPartitioner STARTED

kafka.producer.AsyncProducerTest > testRandomPartitioner PASSED

kafka.producer.AsyncProducerTest > testInvalidConfiguration STARTED

kafka.producer.AsyncProducerTest > testInvalidConfiguration PASSED

kafka.producer.AsyncProducerTest > testInvalidPartition STARTED

kafka.producer.AsyncProducerTest > testInvalidPartition PASSED

kafka.producer.AsyncProducerTest > testNoBroker STARTED

kafka.producer.AsyncProducerTest > testNoBroker PASSED

kafka.producer.AsyncProducerTest > testProduceAfterClosed STARTED

kafka.producer.AsyncProducerTest > testProduceAfterClosed PASSED

kafka.producer.AsyncProducerTest > testJavaProducer STARTED

kafka.producer.AsyncProducerTest > testJavaProducer PASSED

kafka.producer.AsyncProducerTest > testIncompatibleEncoder STARTED

kafka.producer.AsyncProducerTest > testIncompatibleEncoder PASSED

kafka.producer.SyncProducerTest > testReachableServer STARTED

kafka.producer.SyncProducerTest > testReachableServer PASSED

kafka.producer.SyncProducerTest > testMessageSizeTooLarge STARTED

kafka.producer.SyncProducerTest > testMessageSizeTooLarge PASSED

kafka.producer.SyncProducerTest > testNotEnoughReplicas STARTED

kafka.producer.SyncProducerTest > testNotEnoughReplicas PASSED

kafka.producer.SyncProducerTest > testMessageSizeTooLargeWithAckZero STARTED

kafka.producer.SyncProducerTest > testMessageSizeTooLargeWithAckZero PASSED

kafka.producer.SyncProducerTest > testProducerCanTimeout STARTED

kafka.producer.SyncProducerTest > testProducerCanTimeout PASSED

kafka.producer.SyncProducerTest > testProduceRequestWithNoResponse STARTED

kafka.producer.SyncProducerTest > testProduceRequestWithNoResponse PASSED

kafka.producer.SyncProducerTest > testEmptyProduceRequest STARTED

kafka.producer.SyncProducerTest > testEmptyProduceRequest PASSED

kafka.producer.SyncProducerTest > testProduceCorrectlyReceivesResponse STARTED

kafka.producer.SyncProducerTest > testProduceCorrectlyReceivesResponse PASSED

kafka.producer.ProducerTest > testSendToNewTopic STARTED

kafka.producer.ProducerTest > testSendToNewTopic PASSED

kafka.producer.ProducerTest > testAsyncSendCanCorrectlyFailWithTimeout STARTED

kafka.producer.ProducerTest > testAsyncSendCanCorrectlyFailWithTimeout PASSED

kafka.producer.ProducerTest > testSendNullMessage STARTED

kafka.producer.ProducerTest > testSendNullMessage PASSED

kafka.producer.ProducerTest > testUpdateBrokerPartitionInfo STARTED

kafka.producer.ProducerTest > testUpdateBrokerPartitionInfo PASSED

kafka.producer.ProducerTest > testSendWithDeadBroker STARTED

kafka.producer.ProducerTest > testSendWithDeadBroker PASSED

unit.kafka.admin.DeleteConsumerGroupTest > testDeleteCmdInvalidGroupId STARTED

unit.kafka.admin.DeleteConsumerGroupTest > testDeleteCmdInvalidGroupId PASSED

unit.kafka.admin.DeleteConsumerGroupTest > testDeleteNonEmptyGroup STARTED

unit.kafka.admin.DeleteConsumerGroupTest > testDeleteNonEmptyGroup PASSED

unit.kafka.admin.DeleteConsumerGroupTest > testDeleteCmdWithMixOfSuccessAndError STARTED

unit.kafka.admin.DeleteConsumerGroupTest > testDeleteCmdWithMixOfSuccessAndError PASSED

unit.kafka.admin.DeleteConsumerGroupTest > testDeleteWithShortInitialization STARTED

unit.kafka.admin.DeleteConsumerGroupTest > testDeleteWithShortInitialization PASSED

unit.kafka.admin.DeleteConsumerGroupTest > testDeleteCmdWithShortInitialization STARTED

unit.kafka.admin.DeleteConsumerGroupTest > testDeleteCmdWithShortInitialization PASSED

unit.kafka.admin.DeleteConsumerGroupTest > testDeleteWithTopicOption STARTED

unit.kafka.admin.DeleteConsumerGroupTest > testDeleteWithTopicOption PASSED

unit.kafka.admin.DeleteConsumerGroupTest > testDeleteNonExistingGroup STARTED

unit.kafka.admin.DeleteConsumerGroupTest > testDeleteNonExistingGroup PASSED

unit.kafka.admin.DeleteConsumerGroupTest > testDeleteCmdNonEmptyGroup STARTED

unit.kafka.admin.DeleteConsumerGroupTest > testDeleteCmdNonEmptyGroup PASSED

unit.kafka.admin.DeleteConsumerGroupTest > testDeleteCmdNonExistingGroup STARTED

unit.kafka.admin.DeleteConsumerGroupTest > testDeleteCmdNonExistingGroup PASSED

unit.kafka.admin.DeleteConsumerGroupTest > testDeleteEmptyGroup STARTED

unit.kafka.admin.DeleteConsumerGroupTest > testDeleteEmptyGroup PASSED

unit.kafka.admin.DeleteConsumerGroupTest > testDeleteWithMixOfSuccessAndError STARTED

unit.kafka.admin.DeleteConsumerGroupTest > testDeleteWithMixOfSuccessAndError PASSED

unit.kafka.admin.DeleteConsumerGroupTest > testDeleteCmdEmptyGroup STARTED

unit.kafka.admin.DeleteConsumerGroupTest > testDeleteCmdEmptyGroup PASSED

unit.kafka.admin.DeleteConsumerGroupTest > testDeleteInvalidGroupId STARTED

unit.kafka.admin.DeleteConsumerGroupTest > testDeleteInvalidGroupId PASSED

1895 tests completed, 1 failed, 6 skipped
:core:test FAILED

FAILURE: Build failed with an exception.

* What went wrong:
Execution failed for task ':core:test'.
> There were failing tests. See the report at: file://<https://builds.apache.org/job/kafka-trunk-jdk8/ws/core/build/reports/tests/test/index.html>

* Try:
Run with --stacktrace option to get the stack trace. Run with --info or --debug option to
get more log output. Run with --scan to get full insights.

* Get more help at https://help.gradle.org

BUILD FAILED in 1h 9m 58s
32 actionable tasks: 29 executed, 3 up-to-date
Build step 'Execute shell' marked build as failure
[FINDBUGS] Collecting findbugs analysis files...
Setting GRADLE_4_4_HOME=/home/jenkins/tools/gradle/4.4
[FINDBUGS] Searching for all files in <https://builds.apache.org/job/kafka-trunk-jdk8/ws/>
that match the pattern **/build/reports/findbugs/*.xml
[FINDBUGS] Parsing 2 files in <https://builds.apache.org/job/kafka-trunk-jdk8/ws/>
[FINDBUGS] Successfully parsed file <https://builds.apache.org/job/kafka-trunk-jdk8/ws/clients/build/reports/findbugs/main.xml>
with 0 unique warnings and 0 duplicates.
[FINDBUGS] Successfully parsed file <https://builds.apache.org/job/kafka-trunk-jdk8/ws/core/build/reports/findbugs/main.xml>
with 0 unique warnings and 0 duplicates.
Setting GRADLE_4_4_HOME=/home/jenkins/tools/gradle/4.4
Setting GRADLE_4_4_HOME=/home/jenkins/tools/gradle/4.4
<Git Blamer> Using GitBlamer to create author and commit information for all warnings.
<Git Blamer> GIT_COMMIT=9e0e6e43a787092ff908cb17da37ab5dea03978b, workspace=<https://builds.apache.org/job/kafka-trunk-jdk8/ws/>
[FINDBUGS] Computing warning deltas based on reference build #2477
Recording test results
Setting GRADLE_4_4_HOME=/home/jenkins/tools/gradle/4.4
Setting GRADLE_4_4_HOME=/home/jenkins/tools/gradle/4.4
Not sending mail to unregistered user github@alasdairhodge.co.uk
Not sending mail to unregistered user wangguoz@gmail.com
Not sending mail to unregistered user rajinisivaram@googlemail.com

Mime
View raw message