kafka-dev mailing list archives

Site index · List index
Message view « Date » · « Thread »
Top « Date » · « Thread »
From Apache Jenkins Server <jenk...@builds.apache.org>
Subject Build failed in Jenkins: kafka-1.1-jdk7 #22
Date Thu, 08 Feb 2018 03:14:21 GMT
See <https://builds.apache.org/job/kafka-1.1-jdk7/22/display/redirect?page=changes>

Changes:

[jason] KAFKA-6519; Reduce log level for normal replica fetch errors (#4501)

------------------------------------------
[...truncated 411.36 KB...]

kafka.coordinator.transaction.TransactionCoordinatorTest > shouldIncrementEpochAndUpdateMetadataOnHandleInitPidWhenExistingCompleteTransaction
STARTED

kafka.coordinator.transaction.TransactionCoordinatorTest > shouldIncrementEpochAndUpdateMetadataOnHandleInitPidWhenExistingCompleteTransaction
PASSED

kafka.coordinator.transaction.TransactionCoordinatorTest > shouldGenerateNewProducerIdIfEpochsExhausted
STARTED

kafka.coordinator.transaction.TransactionCoordinatorTest > shouldGenerateNewProducerIdIfEpochsExhausted
PASSED

kafka.coordinator.transaction.TransactionCoordinatorTest > shouldRespondWithNotCoordinatorOnInitPidWhenNotCoordinator
STARTED

kafka.coordinator.transaction.TransactionCoordinatorTest > shouldRespondWithNotCoordinatorOnInitPidWhenNotCoordinator
PASSED

kafka.coordinator.transaction.TransactionCoordinatorTest > shouldRespondWithConcurrentTransactionOnAddPartitionsWhenStateIsPrepareAbort
STARTED

kafka.coordinator.transaction.TransactionCoordinatorTest > shouldRespondWithConcurrentTransactionOnAddPartitionsWhenStateIsPrepareAbort
PASSED

kafka.coordinator.transaction.TransactionCoordinatorTest > shouldInitPidWithEpochZeroForNewTransactionalId
STARTED

kafka.coordinator.transaction.TransactionCoordinatorTest > shouldInitPidWithEpochZeroForNewTransactionalId
PASSED

kafka.coordinator.transaction.TransactionStateManagerTest > testAppendTransactionToLogWhileProducerFenced
STARTED

kafka.coordinator.transaction.TransactionStateManagerTest > testAppendTransactionToLogWhileProducerFenced
PASSED

kafka.coordinator.transaction.TransactionStateManagerTest > testCompleteTransitionWhenAppendSucceeded
STARTED

kafka.coordinator.transaction.TransactionStateManagerTest > testCompleteTransitionWhenAppendSucceeded
PASSED

kafka.coordinator.transaction.TransactionStateManagerTest > testAppendFailToCoordinatorNotAvailableError
STARTED

kafka.coordinator.transaction.TransactionStateManagerTest > testAppendFailToCoordinatorNotAvailableError
PASSED

kafka.coordinator.transaction.TransactionStateManagerTest > testAppendFailToUnknownError
STARTED

kafka.coordinator.transaction.TransactionStateManagerTest > testAppendFailToUnknownError
PASSED

kafka.coordinator.transaction.TransactionStateManagerTest > shouldReturnNotCooridnatorErrorIfTransactionIdPartitionNotOwned
STARTED

kafka.coordinator.transaction.TransactionStateManagerTest > shouldReturnNotCooridnatorErrorIfTransactionIdPartitionNotOwned
PASSED

kafka.coordinator.transaction.TransactionStateManagerTest > testValidateTransactionTimeout
STARTED

kafka.coordinator.transaction.TransactionStateManagerTest > testValidateTransactionTimeout
PASSED

kafka.coordinator.transaction.TransactionStateManagerTest > shouldWriteTxnMarkersForTransactionInPreparedCommitState
STARTED

kafka.coordinator.transaction.TransactionStateManagerTest > shouldWriteTxnMarkersForTransactionInPreparedCommitState
PASSED

kafka.coordinator.transaction.TransactionStateManagerTest > shouldOnlyConsiderTransactionsInTheOngoingStateToAbort
STARTED

kafka.coordinator.transaction.TransactionStateManagerTest > shouldOnlyConsiderTransactionsInTheOngoingStateToAbort
PASSED

kafka.coordinator.transaction.TransactionStateManagerTest > shouldRemoveCompleteAbortExpiredTransactionalIds
STARTED

kafka.coordinator.transaction.TransactionStateManagerTest > shouldRemoveCompleteAbortExpiredTransactionalIds
PASSED

kafka.coordinator.transaction.TransactionStateManagerTest > testAppendTransactionToLogWhilePendingStateChanged
STARTED

kafka.coordinator.transaction.TransactionStateManagerTest > testAppendTransactionToLogWhilePendingStateChanged
PASSED

kafka.coordinator.transaction.TransactionStateManagerTest > testLoadAndRemoveTransactionsForPartition
STARTED

kafka.coordinator.transaction.TransactionStateManagerTest > testLoadAndRemoveTransactionsForPartition
PASSED

kafka.coordinator.transaction.TransactionStateManagerTest > testAppendFailToNotCoordinatorError
STARTED

kafka.coordinator.transaction.TransactionStateManagerTest > testAppendFailToNotCoordinatorError
PASSED

kafka.coordinator.transaction.TransactionStateManagerTest > shouldNotRemovePrepareCommitTransactionalIds
STARTED

kafka.coordinator.transaction.TransactionStateManagerTest > shouldNotRemovePrepareCommitTransactionalIds
PASSED

kafka.coordinator.transaction.TransactionStateManagerTest > testAppendFailToCoordinatorLoadingError
STARTED

kafka.coordinator.transaction.TransactionStateManagerTest > testAppendFailToCoordinatorLoadingError
PASSED

kafka.coordinator.transaction.TransactionStateManagerTest > shouldNotRemoveOngoingTransactionalIds
STARTED

kafka.coordinator.transaction.TransactionStateManagerTest > shouldNotRemoveOngoingTransactionalIds
PASSED

kafka.coordinator.transaction.TransactionStateManagerTest > testAddGetPids STARTED

kafka.coordinator.transaction.TransactionStateManagerTest > testAddGetPids PASSED

kafka.coordinator.transaction.TransactionStateManagerTest > shouldWriteTxnMarkersForTransactionInPreparedAbortState
STARTED

kafka.coordinator.transaction.TransactionStateManagerTest > shouldWriteTxnMarkersForTransactionInPreparedAbortState
PASSED

kafka.coordinator.transaction.TransactionStateManagerTest > shouldRemoveEmptyExpiredTransactionalIds
STARTED

kafka.coordinator.transaction.TransactionStateManagerTest > shouldRemoveEmptyExpiredTransactionalIds
PASSED

kafka.coordinator.transaction.TransactionStateManagerTest > testPendingStateNotResetOnRetryAppend
STARTED

kafka.coordinator.transaction.TransactionStateManagerTest > testPendingStateNotResetOnRetryAppend
PASSED

kafka.coordinator.transaction.TransactionStateManagerTest > shouldNotRemoveExpiredTransactionalIdsIfLogAppendFails
STARTED

kafka.coordinator.transaction.TransactionStateManagerTest > shouldNotRemoveExpiredTransactionalIdsIfLogAppendFails
PASSED

kafka.coordinator.transaction.TransactionStateManagerTest > shouldNotRemovePrepareAbortTransactionalIds
STARTED

kafka.coordinator.transaction.TransactionStateManagerTest > shouldNotRemovePrepareAbortTransactionalIds
PASSED

kafka.coordinator.transaction.TransactionStateManagerTest > shouldRemoveCompleteCommmitExpiredTransactionalIds
STARTED

kafka.coordinator.transaction.TransactionStateManagerTest > shouldRemoveCompleteCommmitExpiredTransactionalIds
PASSED

kafka.coordinator.transaction.TransactionMarkerChannelManagerTest > shouldSaveForLaterWhenLeaderUnknownButNotAvailable
STARTED

kafka.coordinator.transaction.TransactionMarkerChannelManagerTest > shouldSaveForLaterWhenLeaderUnknownButNotAvailable
PASSED

kafka.coordinator.transaction.TransactionMarkerChannelManagerTest > shouldGenerateEmptyMapWhenNoRequestsOutstanding
STARTED

kafka.coordinator.transaction.TransactionMarkerChannelManagerTest > shouldGenerateEmptyMapWhenNoRequestsOutstanding
PASSED

kafka.coordinator.transaction.TransactionMarkerChannelManagerTest > shouldCreateMetricsOnStarting
STARTED

kafka.coordinator.transaction.TransactionMarkerChannelManagerTest > shouldCreateMetricsOnStarting
PASSED

kafka.coordinator.transaction.TransactionMarkerChannelManagerTest > shouldAbortAppendToLogOnEndTxnWhenNotCoordinatorError
STARTED

kafka.coordinator.transaction.TransactionMarkerChannelManagerTest > shouldAbortAppendToLogOnEndTxnWhenNotCoordinatorError
PASSED

kafka.coordinator.transaction.TransactionMarkerChannelManagerTest > shouldRetryAppendToLogOnEndTxnWhenCoordinatorNotAvailableError
STARTED

kafka.coordinator.transaction.TransactionMarkerChannelManagerTest > shouldRetryAppendToLogOnEndTxnWhenCoordinatorNotAvailableError
PASSED

kafka.coordinator.transaction.TransactionMarkerChannelManagerTest > shouldCompleteAppendToLogOnEndTxnWhenSendMarkersSucceed
STARTED

kafka.coordinator.transaction.TransactionMarkerChannelManagerTest > shouldCompleteAppendToLogOnEndTxnWhenSendMarkersSucceed
PASSED

kafka.coordinator.transaction.TransactionMarkerChannelManagerTest > shouldGenerateRequestPerPartitionPerBroker
STARTED

kafka.coordinator.transaction.TransactionMarkerChannelManagerTest > shouldGenerateRequestPerPartitionPerBroker
PASSED

kafka.coordinator.transaction.TransactionMarkerChannelManagerTest > shouldRemoveMarkersForTxnPartitionWhenPartitionEmigrated
STARTED

kafka.coordinator.transaction.TransactionMarkerChannelManagerTest > shouldRemoveMarkersForTxnPartitionWhenPartitionEmigrated
PASSED

kafka.coordinator.transaction.TransactionMarkerChannelManagerTest > shouldSkipSendMarkersWhenLeaderNotFound
STARTED

kafka.coordinator.transaction.TransactionMarkerChannelManagerTest > shouldSkipSendMarkersWhenLeaderNotFound
PASSED

kafka.coordinator.transaction.TransactionMetadataTest > testFenceProducerAfterEpochsExhausted
STARTED

kafka.coordinator.transaction.TransactionMetadataTest > testFenceProducerAfterEpochsExhausted
PASSED

kafka.coordinator.transaction.TransactionMetadataTest > testInitializeEpoch STARTED

kafka.coordinator.transaction.TransactionMetadataTest > testInitializeEpoch PASSED

kafka.coordinator.transaction.TransactionMetadataTest > testRotateProducerId STARTED

kafka.coordinator.transaction.TransactionMetadataTest > testRotateProducerId PASSED

kafka.coordinator.transaction.TransactionMetadataTest > testBumpEpochNotAllowedIfEpochsExhausted
STARTED

kafka.coordinator.transaction.TransactionMetadataTest > testBumpEpochNotAllowedIfEpochsExhausted
PASSED

kafka.coordinator.transaction.TransactionMetadataTest > testRotateProducerIdInOngoingState
STARTED

kafka.coordinator.transaction.TransactionMetadataTest > testRotateProducerIdInOngoingState
PASSED

kafka.coordinator.transaction.TransactionMetadataTest > testRotateProducerIdInPrepareCommitState
STARTED

kafka.coordinator.transaction.TransactionMetadataTest > testRotateProducerIdInPrepareCommitState
PASSED

kafka.coordinator.transaction.TransactionMetadataTest > testFenceProducerNotAllowedIfItWouldOverflow
STARTED

kafka.coordinator.transaction.TransactionMetadataTest > testFenceProducerNotAllowedIfItWouldOverflow
PASSED

kafka.coordinator.transaction.TransactionMetadataTest > testRotateProducerIdInPrepareAbortState
STARTED

kafka.coordinator.transaction.TransactionMetadataTest > testRotateProducerIdInPrepareAbortState
PASSED

kafka.coordinator.transaction.TransactionMetadataTest > testNormalEpochBump STARTED

kafka.coordinator.transaction.TransactionMetadataTest > testNormalEpochBump PASSED

kafka.javaapi.message.ByteBufferMessageSetTest > testSizeInBytesWithCompression STARTED

kafka.javaapi.message.ByteBufferMessageSetTest > testSizeInBytesWithCompression PASSED

kafka.javaapi.message.ByteBufferMessageSetTest > testIteratorIsConsistentWithCompression
STARTED

kafka.javaapi.message.ByteBufferMessageSetTest > testIteratorIsConsistentWithCompression
PASSED

kafka.javaapi.message.ByteBufferMessageSetTest > testIteratorIsConsistent STARTED

kafka.javaapi.message.ByteBufferMessageSetTest > testIteratorIsConsistent PASSED

kafka.javaapi.message.ByteBufferMessageSetTest > testEqualsWithCompression STARTED

kafka.javaapi.message.ByteBufferMessageSetTest > testEqualsWithCompression PASSED

kafka.javaapi.message.ByteBufferMessageSetTest > testWrittenEqualsRead STARTED

kafka.javaapi.message.ByteBufferMessageSetTest > testWrittenEqualsRead PASSED

kafka.javaapi.message.ByteBufferMessageSetTest > testEquals STARTED

kafka.javaapi.message.ByteBufferMessageSetTest > testEquals PASSED

kafka.javaapi.message.ByteBufferMessageSetTest > testSizeInBytes STARTED

kafka.javaapi.message.ByteBufferMessageSetTest > testSizeInBytes PASSED

kafka.javaapi.consumer.ZookeeperConsumerConnectorTest > testBasic STARTED

kafka.javaapi.consumer.ZookeeperConsumerConnectorTest > testBasic PASSED

1854 tests completed, 2 failed, 6 skipped
:kafka-1.1-jdk7:core:test FAILED
:test_core_2_11 FAILED

FAILURE: Build failed with an exception.

* What went wrong:
Execution failed for task ':kafka-1.1-jdk7:core:test'.
> There were failing tests. See the report at: file://<https://builds.apache.org/job/kafka-1.1-jdk7/ws/core/build/reports/tests/test/index.html>

* Try:
Run with --stacktrace option to get the stack trace. Run with --info or --debug option to
get more log output. Run with --scan to get full insights.

* Get more help at https://help.gradle.org

BUILD FAILED in 1h 37m 20s
17 actionable tasks: 14 executed, 3 up-to-date
Build step 'Execute shell' marked build as failure
[FINDBUGS] Collecting findbugs analysis files...
ERROR: No tool found matching GRADLE_3_4_RC_2_HOME
Setting GRADLE_3_5_HOME=/home/jenkins/tools/gradle/3.5
[FINDBUGS] Searching for all files in <https://builds.apache.org/job/kafka-1.1-jdk7/ws/>
that match the pattern **/build/reports/findbugs/*.xml
[FINDBUGS] Parsing 1 file in <https://builds.apache.org/job/kafka-1.1-jdk7/ws/>
[FINDBUGS] Successfully parsed file <https://builds.apache.org/job/kafka-1.1-jdk7/ws/core/build/reports/findbugs/main.xml>
with 0 unique warnings and 0 duplicates.
ERROR: No tool found matching GRADLE_3_4_RC_2_HOME
Setting GRADLE_3_5_HOME=/home/jenkins/tools/gradle/3.5
ERROR: No tool found matching GRADLE_3_4_RC_2_HOME
Setting GRADLE_3_5_HOME=/home/jenkins/tools/gradle/3.5
<Git Blamer> Using GitBlamer to create author and commit information for all warnings.
<Git Blamer> GIT_COMMIT=84ff9f303539dc8770b3bcad975e8ed32fcc42df, workspace=<https://builds.apache.org/job/kafka-1.1-jdk7/ws/>
[FINDBUGS] Computing warning deltas based on reference build #21
Recording test results
ERROR: No tool found matching GRADLE_3_4_RC_2_HOME
Setting GRADLE_3_5_HOME=/home/jenkins/tools/gradle/3.5
ERROR: No tool found matching GRADLE_3_4_RC_2_HOME
Setting GRADLE_3_5_HOME=/home/jenkins/tools/gradle/3.5

Mime
View raw message