kafka-dev mailing list archives

Site index · List index
Message view « Date » · « Thread »
Top « Date » · « Thread »
From Apache Jenkins Server <jenk...@builds.apache.org>
Subject Build failed in Jenkins: kafka-trunk-jdk7 #3203
Date Wed, 21 Feb 2018 20:36:31 GMT
See <https://builds.apache.org/job/kafka-trunk-jdk7/3203/display/redirect?page=changes>

Changes:

[me] MINOR: Cancel port forwarding for HttpMetricsCollector during cleanup

------------------------------------------
[...truncated 409.51 KB...]

kafka.coordinator.transaction.TransactionCoordinatorTest > shouldRespondWithConcurrentTransactionsOnAddPartitionsWhenStateIsPrepareCommit
PASSED

kafka.coordinator.transaction.TransactionCoordinatorTest > shouldIncrementEpochAndUpdateMetadataOnHandleInitPidWhenExistingCompleteTransaction
STARTED

kafka.coordinator.transaction.TransactionCoordinatorTest > shouldIncrementEpochAndUpdateMetadataOnHandleInitPidWhenExistingCompleteTransaction
PASSED

kafka.coordinator.transaction.TransactionCoordinatorTest > shouldGenerateNewProducerIdIfEpochsExhausted
STARTED

kafka.coordinator.transaction.TransactionCoordinatorTest > shouldGenerateNewProducerIdIfEpochsExhausted
PASSED

kafka.coordinator.transaction.TransactionCoordinatorTest > shouldRespondWithNotCoordinatorOnInitPidWhenNotCoordinator
STARTED

kafka.coordinator.transaction.TransactionCoordinatorTest > shouldRespondWithNotCoordinatorOnInitPidWhenNotCoordinator
PASSED

kafka.coordinator.transaction.TransactionCoordinatorTest > shouldRespondWithConcurrentTransactionOnAddPartitionsWhenStateIsPrepareAbort
STARTED

kafka.coordinator.transaction.TransactionCoordinatorTest > shouldRespondWithConcurrentTransactionOnAddPartitionsWhenStateIsPrepareAbort
PASSED

kafka.coordinator.transaction.TransactionCoordinatorTest > shouldInitPidWithEpochZeroForNewTransactionalId
STARTED

kafka.coordinator.transaction.TransactionCoordinatorTest > shouldInitPidWithEpochZeroForNewTransactionalId
PASSED

kafka.coordinator.transaction.ProducerIdManagerTest > testExceedProducerIdLimit STARTED

kafka.coordinator.transaction.ProducerIdManagerTest > testExceedProducerIdLimit PASSED

kafka.coordinator.transaction.ProducerIdManagerTest > testGetProducerId STARTED

kafka.coordinator.transaction.ProducerIdManagerTest > testGetProducerId PASSED

kafka.coordinator.transaction.TransactionMarkerChannelManagerTest > shouldSaveForLaterWhenLeaderUnknownButNotAvailable
STARTED

kafka.coordinator.transaction.TransactionMarkerChannelManagerTest > shouldSaveForLaterWhenLeaderUnknownButNotAvailable
PASSED

kafka.coordinator.transaction.TransactionMarkerChannelManagerTest > shouldGenerateEmptyMapWhenNoRequestsOutstanding
STARTED

kafka.coordinator.transaction.TransactionMarkerChannelManagerTest > shouldGenerateEmptyMapWhenNoRequestsOutstanding
PASSED

kafka.coordinator.transaction.TransactionMarkerChannelManagerTest > shouldCreateMetricsOnStarting
STARTED

kafka.coordinator.transaction.TransactionMarkerChannelManagerTest > shouldCreateMetricsOnStarting
PASSED

kafka.coordinator.transaction.TransactionMarkerChannelManagerTest > shouldAbortAppendToLogOnEndTxnWhenNotCoordinatorError
STARTED

kafka.coordinator.transaction.TransactionMarkerChannelManagerTest > shouldAbortAppendToLogOnEndTxnWhenNotCoordinatorError
PASSED

kafka.coordinator.transaction.TransactionMarkerChannelManagerTest > shouldRetryAppendToLogOnEndTxnWhenCoordinatorNotAvailableError
STARTED

kafka.coordinator.transaction.TransactionMarkerChannelManagerTest > shouldRetryAppendToLogOnEndTxnWhenCoordinatorNotAvailableError
PASSED

kafka.coordinator.transaction.TransactionMarkerChannelManagerTest > shouldCompleteAppendToLogOnEndTxnWhenSendMarkersSucceed
STARTED

kafka.coordinator.transaction.TransactionMarkerChannelManagerTest > shouldCompleteAppendToLogOnEndTxnWhenSendMarkersSucceed
PASSED

kafka.coordinator.transaction.TransactionMarkerChannelManagerTest > shouldGenerateRequestPerPartitionPerBroker
STARTED

kafka.coordinator.transaction.TransactionMarkerChannelManagerTest > shouldGenerateRequestPerPartitionPerBroker
PASSED

kafka.coordinator.transaction.TransactionMarkerChannelManagerTest > shouldRemoveMarkersForTxnPartitionWhenPartitionEmigrated
STARTED

kafka.coordinator.transaction.TransactionMarkerChannelManagerTest > shouldRemoveMarkersForTxnPartitionWhenPartitionEmigrated
PASSED

kafka.coordinator.transaction.TransactionMarkerChannelManagerTest > shouldSkipSendMarkersWhenLeaderNotFound
STARTED

kafka.coordinator.transaction.TransactionMarkerChannelManagerTest > shouldSkipSendMarkersWhenLeaderNotFound
PASSED

kafka.coordinator.transaction.TransactionLogTest > shouldReadWriteMessages STARTED

kafka.coordinator.transaction.TransactionLogTest > shouldReadWriteMessages PASSED

kafka.coordinator.transaction.TransactionLogTest > shouldThrowExceptionWriteInvalidTxn
STARTED

kafka.coordinator.transaction.TransactionLogTest > shouldThrowExceptionWriteInvalidTxn
PASSED

kafka.coordinator.transaction.TransactionStateManagerTest > testAppendTransactionToLogWhileProducerFenced
STARTED

kafka.coordinator.transaction.TransactionStateManagerTest > testAppendTransactionToLogWhileProducerFenced
PASSED

kafka.coordinator.transaction.TransactionStateManagerTest > testCompleteTransitionWhenAppendSucceeded
STARTED

kafka.coordinator.transaction.TransactionStateManagerTest > testCompleteTransitionWhenAppendSucceeded
PASSED

kafka.coordinator.transaction.TransactionStateManagerTest > testAppendFailToCoordinatorNotAvailableError
STARTED

kafka.coordinator.transaction.TransactionStateManagerTest > testAppendFailToCoordinatorNotAvailableError
PASSED

kafka.coordinator.transaction.TransactionStateManagerTest > testAppendFailToUnknownError
STARTED

kafka.coordinator.transaction.TransactionStateManagerTest > testAppendFailToUnknownError
PASSED

kafka.coordinator.transaction.TransactionStateManagerTest > shouldReturnNotCooridnatorErrorIfTransactionIdPartitionNotOwned
STARTED

kafka.coordinator.transaction.TransactionStateManagerTest > shouldReturnNotCooridnatorErrorIfTransactionIdPartitionNotOwned
PASSED

kafka.coordinator.transaction.TransactionStateManagerTest > testValidateTransactionTimeout
STARTED

kafka.coordinator.transaction.TransactionStateManagerTest > testValidateTransactionTimeout
PASSED

kafka.coordinator.transaction.TransactionStateManagerTest > shouldWriteTxnMarkersForTransactionInPreparedCommitState
STARTED

kafka.coordinator.transaction.TransactionStateManagerTest > shouldWriteTxnMarkersForTransactionInPreparedCommitState
PASSED

kafka.coordinator.transaction.TransactionStateManagerTest > shouldOnlyConsiderTransactionsInTheOngoingStateToAbort
STARTED

kafka.coordinator.transaction.TransactionStateManagerTest > shouldOnlyConsiderTransactionsInTheOngoingStateToAbort
PASSED

kafka.coordinator.transaction.TransactionStateManagerTest > shouldRemoveCompleteAbortExpiredTransactionalIds
STARTED

kafka.coordinator.transaction.TransactionStateManagerTest > shouldRemoveCompleteAbortExpiredTransactionalIds
PASSED

kafka.coordinator.transaction.TransactionStateManagerTest > testAppendTransactionToLogWhilePendingStateChanged
STARTED

kafka.coordinator.transaction.TransactionStateManagerTest > testAppendTransactionToLogWhilePendingStateChanged
PASSED

kafka.coordinator.transaction.TransactionStateManagerTest > testLoadAndRemoveTransactionsForPartition
STARTED

kafka.coordinator.transaction.TransactionStateManagerTest > testLoadAndRemoveTransactionsForPartition
PASSED

kafka.coordinator.transaction.TransactionStateManagerTest > testAppendFailToNotCoordinatorError
STARTED

kafka.coordinator.transaction.TransactionStateManagerTest > testAppendFailToNotCoordinatorError
PASSED

kafka.coordinator.transaction.TransactionStateManagerTest > shouldNotRemovePrepareCommitTransactionalIds
STARTED

kafka.coordinator.transaction.TransactionStateManagerTest > shouldNotRemovePrepareCommitTransactionalIds
PASSED

kafka.coordinator.transaction.TransactionStateManagerTest > testAppendFailToCoordinatorLoadingError
STARTED

kafka.coordinator.transaction.TransactionStateManagerTest > testAppendFailToCoordinatorLoadingError
PASSED

kafka.coordinator.transaction.TransactionStateManagerTest > shouldNotRemoveOngoingTransactionalIds
STARTED

kafka.coordinator.transaction.TransactionStateManagerTest > shouldNotRemoveOngoingTransactionalIds
PASSED

kafka.coordinator.transaction.TransactionStateManagerTest > testAddGetPids STARTED

kafka.coordinator.transaction.TransactionStateManagerTest > testAddGetPids PASSED

kafka.coordinator.transaction.TransactionStateManagerTest > shouldWriteTxnMarkersForTransactionInPreparedAbortState
STARTED

kafka.coordinator.transaction.TransactionStateManagerTest > shouldWriteTxnMarkersForTransactionInPreparedAbortState
PASSED

kafka.coordinator.transaction.TransactionStateManagerTest > shouldRemoveEmptyExpiredTransactionalIds
STARTED

kafka.coordinator.transaction.TransactionStateManagerTest > shouldRemoveEmptyExpiredTransactionalIds
PASSED

kafka.coordinator.transaction.TransactionStateManagerTest > testPendingStateNotResetOnRetryAppend
STARTED

kafka.coordinator.transaction.TransactionStateManagerTest > testPendingStateNotResetOnRetryAppend
PASSED

kafka.coordinator.transaction.TransactionStateManagerTest > shouldNotRemoveExpiredTransactionalIdsIfLogAppendFails
STARTED

kafka.coordinator.transaction.TransactionStateManagerTest > shouldNotRemoveExpiredTransactionalIdsIfLogAppendFails
PASSED

kafka.coordinator.transaction.TransactionStateManagerTest > shouldNotRemovePrepareAbortTransactionalIds
STARTED

kafka.coordinator.transaction.TransactionStateManagerTest > shouldNotRemovePrepareAbortTransactionalIds
PASSED

kafka.coordinator.transaction.TransactionStateManagerTest > shouldRemoveCompleteCommmitExpiredTransactionalIds
STARTED

kafka.coordinator.transaction.TransactionStateManagerTest > shouldRemoveCompleteCommmitExpiredTransactionalIds
PASSED

unit.kafka.admin.DeleteConsumerGroupTest > testDeleteCmdInvalidGroupId STARTED

unit.kafka.admin.DeleteConsumerGroupTest > testDeleteCmdInvalidGroupId PASSED

unit.kafka.admin.DeleteConsumerGroupTest > testDeleteNonEmptyGroup STARTED

unit.kafka.admin.DeleteConsumerGroupTest > testDeleteNonEmptyGroup PASSED

unit.kafka.admin.DeleteConsumerGroupTest > testDeleteCmdWithMixOfSuccessAndError STARTED

unit.kafka.admin.DeleteConsumerGroupTest > testDeleteCmdWithMixOfSuccessAndError PASSED

unit.kafka.admin.DeleteConsumerGroupTest > testDeleteWithShortInitialization STARTED

unit.kafka.admin.DeleteConsumerGroupTest > testDeleteWithShortInitialization PASSED

unit.kafka.admin.DeleteConsumerGroupTest > testDeleteCmdWithShortInitialization STARTED

unit.kafka.admin.DeleteConsumerGroupTest > testDeleteCmdWithShortInitialization PASSED

unit.kafka.admin.DeleteConsumerGroupTest > testDeleteWithTopicOption STARTED

unit.kafka.admin.DeleteConsumerGroupTest > testDeleteWithTopicOption PASSED

unit.kafka.admin.DeleteConsumerGroupTest > testDeleteNonExistingGroup STARTED

unit.kafka.admin.DeleteConsumerGroupTest > testDeleteNonExistingGroup PASSED

unit.kafka.admin.DeleteConsumerGroupTest > testDeleteCmdNonEmptyGroup STARTED

unit.kafka.admin.DeleteConsumerGroupTest > testDeleteCmdNonEmptyGroup PASSED

unit.kafka.admin.DeleteConsumerGroupTest > testDeleteCmdNonExistingGroup STARTED

unit.kafka.admin.DeleteConsumerGroupTest > testDeleteCmdNonExistingGroup PASSED

unit.kafka.admin.DeleteConsumerGroupTest > testDeleteEmptyGroup STARTED

unit.kafka.admin.DeleteConsumerGroupTest > testDeleteEmptyGroup PASSED

unit.kafka.admin.DeleteConsumerGroupTest > testDeleteWithMixOfSuccessAndError STARTED

unit.kafka.admin.DeleteConsumerGroupTest > testDeleteWithMixOfSuccessAndError PASSED

unit.kafka.admin.DeleteConsumerGroupTest > testDeleteCmdEmptyGroup STARTED

unit.kafka.admin.DeleteConsumerGroupTest > testDeleteCmdEmptyGroup PASSED

unit.kafka.admin.DeleteConsumerGroupTest > testDeleteInvalidGroupId STARTED

unit.kafka.admin.DeleteConsumerGroupTest > testDeleteInvalidGroupId PASSED

1867 tests completed, 1 failed, 6 skipped
:kafka-trunk-jdk7:core:test FAILED
:test_core_2_11 FAILED

FAILURE: Build failed with an exception.

* What went wrong:
Execution failed for task ':kafka-trunk-jdk7:core:test'.
> There were failing tests. See the report at: file://<https://builds.apache.org/job/kafka-trunk-jdk7/ws/core/build/reports/tests/test/index.html>

* Try:
Run with --stacktrace option to get the stack trace. Run with --info or --debug option to
get more log output. Run with --scan to get full insights.

* Get more help at https://help.gradle.org

Deprecated Gradle features were used in this build, making it incompatible with Gradle 5.0.
See https://docs.gradle.org/4.5.1/userguide/command_line_interface.html#sec:command_line_warnings

BUILD FAILED in 56m 43s
17 actionable tasks: 9 executed, 8 up-to-date
Build step 'Execute shell' marked build as failure
[FINDBUGS] Collecting findbugs analysis files...
Setting GRADLE_3_5_HOME=/home/jenkins/tools/gradle/3.5
[FINDBUGS] Searching for all files in <https://builds.apache.org/job/kafka-trunk-jdk7/ws/>
that match the pattern **/build/reports/findbugs/*.xml
[FINDBUGS] Parsing 1 file in <https://builds.apache.org/job/kafka-trunk-jdk7/ws/>
[FINDBUGS] Successfully parsed file <https://builds.apache.org/job/kafka-trunk-jdk7/ws/core/build/reports/findbugs/main.xml>
with 0 unique warnings and 0 duplicates.
Setting GRADLE_3_5_HOME=/home/jenkins/tools/gradle/3.5
Setting GRADLE_3_5_HOME=/home/jenkins/tools/gradle/3.5
<Git Blamer> Using GitBlamer to create author and commit information for all warnings.
<Git Blamer> GIT_COMMIT=da379c95e4e3fe4dbe4d810a27a2d0b821cb2fb1, workspace=<https://builds.apache.org/job/kafka-trunk-jdk7/ws/>
[FINDBUGS] Computing warning deltas based on reference build #3201
Recording test results
Setting GRADLE_3_5_HOME=/home/jenkins/tools/gradle/3.5
Setting GRADLE_3_5_HOME=/home/jenkins/tools/gradle/3.5

Mime
View raw message