kafka-dev mailing list archives

Site index · List index
Message view « Date » · « Thread »
Top « Date » · « Thread »
From Apache Jenkins Server <jenk...@builds.apache.org>
Subject Build failed in Jenkins: kafka-1.0-jdk7 #127
Date Thu, 18 Jan 2018 23:12:22 GMT
See <https://builds.apache.org/job/kafka-1.0-jdk7/127/display/redirect?page=changes>

Changes:

[wangguoz] KAFKA-6398: Return value getter based on KTable materialization status

------------------------------------------
[...truncated 1.44 MB...]
<https://builds.apache.org/job/kafka-1.0-jdk7/ws/streams/src/main/java/org/apache/kafka/streams/kstream/internals/KTableImpl.java>:199:
warning: [deprecation] filter(Predicate<? super K,? super V>,String) in KTable has been
deprecated
    public KTable<K, V> filter(final Predicate<? super K, ? super V> predicate,
                        ^
  where K,V are type-variables:
    K extends Object declared in interface KTable
    V extends Object declared in interface KTable
<https://builds.apache.org/job/kafka-1.0-jdk7/ws/streams/src/main/java/org/apache/kafka/streams/kstream/internals/KStreamImpl.java>:800:
warning: [deprecation] <VT,VR>leftJoin(KTable<K,VT>,ValueJoiner<? super V,?
super VT,? extends VR>,Serde<K>,Serde<V>) in KStream has been deprecated
    public <V1, R> KStream<K, R> leftJoin(final KTable<K, V1> other,
                                 ^
  where VT,VR,K,V are type-variables:
    VT extends Object declared in method <VT,VR>leftJoin(KTable<K,VT>,ValueJoiner<?
super V,? super VT,? extends VR>,Serde<K>,Serde<V>)
    VR extends Object declared in method <VT,VR>leftJoin(KTable<K,VT>,ValueJoiner<?
super V,? super VT,? extends VR>,Serde<K>,Serde<V>)
    K extends Object declared in interface KStream
    V extends Object declared in interface KStream
<https://builds.apache.org/job/kafka-1.0-jdk7/ws/streams/src/main/java/org/apache/kafka/streams/kstream/internals/KStreamImpl.java>:726:
warning: [deprecation] <VT,VR>join(KTable<K,VT>,ValueJoiner<? super V,? super
VT,? extends VR>,Serde<K>,Serde<V>) in KStream has been deprecated
    public <V1, R> KStream<K, R> join(final KTable<K, V1> other,
                                 ^
  where VT,VR,K,V are type-variables:
    VT extends Object declared in method <VT,VR>join(KTable<K,VT>,ValueJoiner<?
super V,? super VT,? extends VR>,Serde<K>,Serde<V>)
    VR extends Object declared in method <VT,VR>join(KTable<K,VT>,ValueJoiner<?
super V,? super VT,? extends VR>,Serde<K>,Serde<V>)
    K extends Object declared in interface KStream
    V extends Object declared in interface KStream
<https://builds.apache.org/job/kafka-1.0-jdk7/ws/streams/src/main/java/org/apache/kafka/streams/kstream/internals/KStreamImpl.java>:568:
warning: [deprecation] <VO,VR>outerJoin(KStream<K,VO>,ValueJoiner<? super V,?
super VO,? extends VR>,JoinWindows,Serde<K>,Serde<V>,Serde<VO>) in KStream
has been deprecated
    public <V1, R> KStream<K, R> outerJoin(final KStream<K, V1> other,
                                 ^
  where VO,VR,K,V are type-variables:
    VO extends Object declared in method <VO,VR>outerJoin(KStream<K,VO>,ValueJoiner<?
super V,? super VO,? extends VR>,JoinWindows,Serde<K>,Serde<V>,Serde<VO>)
    VR extends Object declared in method <VO,VR>outerJoin(KStream<K,VO>,ValueJoiner<?
super V,? super VO,? extends VR>,JoinWindows,Serde<K>,Serde<V>,Serde<VO>)
    K extends Object declared in interface KStream
    V extends Object declared in interface KStream
<https://builds.apache.org/job/kafka-1.0-jdk7/ws/streams/src/main/java/org/apache/kafka/streams/kstream/internals/KStreamImpl.java>:670:
warning: [deprecation] <VO,VR>leftJoin(KStream<K,VO>,ValueJoiner<? super V,?
super VO,? extends VR>,JoinWindows,Serde<K>,Serde<V>,Serde<VO>) in KStream
has been deprecated
    public <V1, R> KStream<K, R> leftJoin(final KStream<K, V1> other,
                                 ^
  where VO,VR,K,V are type-variables:
    VO extends Object declared in method <VO,VR>leftJoin(KStream<K,VO>,ValueJoiner<?
super V,? super VO,? extends VR>,JoinWindows,Serde<K>,Serde<V>,Serde<VO>)
    VR extends Object declared in method <VO,VR>leftJoin(KStream<K,VO>,ValueJoiner<?
super V,? super VO,? extends VR>,JoinWindows,Serde<K>,Serde<V>,Serde<VO>)
    K extends Object declared in interface KStream
    V extends Object declared in interface KStream
<https://builds.apache.org/job/kafka-1.0-jdk7/ws/streams/src/main/java/org/apache/kafka/streams/kstream/internals/KStreamImpl.java>:540:
warning: [deprecation] <VO,VR>join(KStream<K,VO>,ValueJoiner<? super V,? super
VO,? extends VR>,JoinWindows,Serde<K>,Serde<V>,Serde<VO>) in KStream
has been deprecated
    public <V1, R> KStream<K, R> join(final KStream<K, V1> other,
                                 ^
  where VO,VR,K,V are type-variables:
    VO extends Object declared in method <VO,VR>join(KStream<K,VO>,ValueJoiner<?
super V,? super VO,? extends VR>,JoinWindows,Serde<K>,Serde<V>,Serde<VO>)
    VR extends Object declared in method <VO,VR>join(KStream<K,VO>,ValueJoiner<?
super V,? super VO,? extends VR>,JoinWindows,Serde<K>,Serde<V>,Serde<VO>)
    K extends Object declared in interface KStream
    V extends Object declared in interface KStream
<https://builds.apache.org/job/kafka-1.0-jdk7/ws/streams/src/main/java/org/apache/kafka/streams/kstream/internals/KStreamImpl.java>:829:
warning: [deprecation] <KR>groupBy(KeyValueMapper<? super K,? super V,KR>,Serde<KR>,Serde<V>)
in KStream has been deprecated
    public <K1> KGroupedStream<K1, V> groupBy(final KeyValueMapper<? super
K, ? super V, K1> selector,
                                      ^
  where KR,K,V are type-variables:
    KR extends Object declared in method <KR>groupBy(KeyValueMapper<? super K,? super
V,KR>,Serde<KR>,Serde<V>)
    K extends Object declared in interface KStream
    V extends Object declared in interface KStream
<https://builds.apache.org/job/kafka-1.0-jdk7/ws/streams/src/main/java/org/apache/kafka/streams/kstream/internals/KStreamImpl.java>:855:
warning: [deprecation] groupByKey(Serde<K>,Serde<V>) in KStream has been deprecated
    public KGroupedStream<K, V> groupByKey(final Serde<K> keySerde,
                                ^
  where K,V are type-variables:
    K extends Object declared in interface KStream
    V extends Object declared in interface KStream
<https://builds.apache.org/job/kafka-1.0-jdk7/ws/streams/src/main/java/org/apache/kafka/streams/kstream/internals/KStreamImpl.java>:466:
warning: [deprecation] to(Serde<K>,Serde<V>,StreamPartitioner<? super K,? super
V>,String) in KStream has been deprecated
    public void to(final Serde<K> keySerde,
                ^
  where K,V are type-variables:
    K extends Object declared in interface KStream
    V extends Object declared in interface KStream
<https://builds.apache.org/job/kafka-1.0-jdk7/ws/streams/src/main/java/org/apache/kafka/streams/kstream/internals/KStreamImpl.java>:458:
warning: [deprecation] to(Serde<K>,Serde<V>,String) in KStream has been deprecated
    public void to(final Serde<K> keySerde,
                ^
  where K,V are type-variables:
    K extends Object declared in interface KStream
    V extends Object declared in interface KStream
<https://builds.apache.org/job/kafka-1.0-jdk7/ws/streams/src/main/java/org/apache/kafka/streams/kstream/internals/KStreamImpl.java>:451:
warning: [deprecation] to(StreamPartitioner<? super K,? super V>,String) in KStream
has been deprecated
    public void to(final StreamPartitioner<? super K, ? super V> partitioner,
                ^
  where K,V are type-variables:
    K extends Object declared in interface KStream
    V extends Object declared in interface KStream
<https://builds.apache.org/job/kafka-1.0-jdk7/ws/streams/src/main/java/org/apache/kafka/streams/kstream/internals/KStreamImpl.java>:389:
warning: [deprecation] through(Serde<K>,Serde<V>,StreamPartitioner<? super
K,? super V>,String) in KStream has been deprecated
    public KStream<K, V> through(final Serde<K> keySerde,
                         ^
  where K,V are type-variables:
    K extends Object declared in interface KStream
    V extends Object declared in interface KStream
<https://builds.apache.org/job/kafka-1.0-jdk7/ws/streams/src/main/java/org/apache/kafka/streams/kstream/internals/KStreamImpl.java>:426:
warning: [deprecation] through(Serde<K>,Serde<V>,String) in KStream has been deprecated
    public KStream<K, V> through(final Serde<K> keySerde,
                         ^
  where K,V are type-variables:
    K extends Object declared in interface KStream
    V extends Object declared in interface KStream
<https://builds.apache.org/job/kafka-1.0-jdk7/ws/streams/src/main/java/org/apache/kafka/streams/kstream/internals/KStreamImpl.java>:434:
warning: [deprecation] through(StreamPartitioner<? super K,? super V>,String) in KStream
has been deprecated
    public KStream<K, V> through(final StreamPartitioner<? super K, ? super V>
partitioner,
                         ^
  where K,V are type-variables:
    K extends Object declared in interface KStream
    V extends Object declared in interface KStream
<https://builds.apache.org/job/kafka-1.0-jdk7/ws/streams/src/main/java/org/apache/kafka/streams/kstream/internals/KStreamImpl.java>:310:
warning: [deprecation] writeAsText(String,String,Serde<K>,Serde<V>,KeyValueMapper<?
super K,? super V,String>) in KStream has been deprecated
    public void writeAsText(final String filePath,
                ^
  where K,V are type-variables:
    K extends Object declared in interface KStream
    V extends Object declared in interface KStream
<https://builds.apache.org/job/kafka-1.0-jdk7/ws/streams/src/main/java/org/apache/kafka/streams/kstream/internals/KStreamImpl.java>:301:
warning: [deprecation] writeAsText(String,Serde<K>,Serde<V>,KeyValueMapper<?
super K,? super V,String>) in KStream has been deprecated
    public void writeAsText(final String filePath,
                ^
  where K,V are type-variables:
    K extends Object declared in interface KStream
    V extends Object declared in interface KStream
<https://builds.apache.org/job/kafka-1.0-jdk7/ws/streams/src/main/java/org/apache/kafka/streams/kstream/internals/KStreamImpl.java>:293:
warning: [deprecation] writeAsText(String,String,KeyValueMapper<? super K,? super V,String>)
in KStream has been deprecated
    public void writeAsText(final String filePath,
                ^
  where K,V are type-variables:
    K extends Object declared in interface KStream
    V extends Object declared in interface KStream
<https://builds.apache.org/job/kafka-1.0-jdk7/ws/streams/src/main/java/org/apache/kafka/streams/kstream/internals/KStreamImpl.java>:286:
warning: [deprecation] writeAsText(String,KeyValueMapper<? super K,? super V,String>)
in KStream has been deprecated
    public void writeAsText(final String filePath,
                ^
  where K,V are type-variables:
    K extends Object declared in interface KStream
    V extends Object declared in interface KStream
<https://builds.apache.org/job/kafka-1.0-jdk7/ws/streams/src/main/java/org/apache/kafka/streams/kstream/internals/KStreamImpl.java>:277:
warning: [deprecation] writeAsText(String,String,Serde<K>,Serde<V>) in KStream
has been deprecated
    public void writeAsText(final String filePath,
                ^
  where K,V are type-variables:
    K extends Object declared in interface KStream
    V extends Object declared in interface KStream
<https://builds.apache.org/job/kafka-1.0-jdk7/ws/streams/src/main/java/org/apache/kafka/streams/kstream/internals/KStreamImpl.java>:269:
warning: [deprecation] writeAsText(String,Serde<K>,Serde<V>) in KStream has been
deprecated
    public void writeAsText(final String filePath,
                ^
  where K,V are type-variables:
    K extends Object declared in interface KStream
    V extends Object declared in interface KStream
<https://builds.apache.org/job/kafka-1.0-jdk7/ws/streams/src/main/java/org/apache/kafka/streams/kstream/internals/KStreamImpl.java>:262:
warning: [deprecation] writeAsText(String,String) in KStream has been deprecated
    public void writeAsText(final String filePath,
                ^
<https://builds.apache.org/job/kafka-1.0-jdk7/ws/streams/src/main/java/org/apache/kafka/streams/kstream/internals/KStreamImpl.java>:256:
warning: [deprecation] writeAsText(String) in KStream has been deprecated
    public void writeAsText(final String filePath) {
                ^
<https://builds.apache.org/job/kafka-1.0-jdk7/ws/streams/src/main/java/org/apache/kafka/streams/kstream/internals/KStreamImpl.java>:237:
warning: [deprecation] print(KeyValueMapper<? super K,? super V,String>,Serde<K>,Serde<V>,String)
in KStream has been deprecated
    public void print(final KeyValueMapper<? super K, ? super V, String> mapper,
                ^
  where K,V are type-variables:
    K extends Object declared in interface KStream
    V extends Object declared in interface KStream
<https://builds.apache.org/job/kafka-1.0-jdk7/ws/streams/src/main/java/org/apache/kafka/streams/kstream/internals/KStreamImpl.java>:229:
warning: [deprecation] print(KeyValueMapper<? super K,? super V,String>,Serde<K>,Serde<V>)
in KStream has been deprecated
    public void print(final KeyValueMapper<? super K, ? super V, String> mapper,
                ^
  where K,V are type-variables:
    K extends Object declared in interface KStream
    V extends Object declared in interface KStream
Note: Some input files additionally use or override a deprecated API.
Note: Some input files use unchecked or unsafe operations.
Note: Recompile with -Xlint:unchecked for details.
100 warnings

:streams:processResources NO-SOURCE
:streams:classes
:streams:checkstyleMain
:streams:compileTestJava<https://builds.apache.org/job/kafka-1.0-jdk7/ws/streams/src/test/java/org/apache/kafka/streams/StreamsBuilderTest.java>:75:
error: no suitable method found for build()
        ProcessorTopology topology = builder.internalTopologyBuilder.build();
                                                                    ^
    method InternalTopologyBuilder.build(Set<String>) is not applicable
      (actual and formal argument lists differ in length)
    method InternalTopologyBuilder.build(Integer) is not applicable
      (actual and formal argument lists differ in length)
<https://builds.apache.org/job/kafka-1.0-jdk7/ws/streams/src/test/java/org/apache/kafka/streams/StreamsBuilderTest.java>:90:
error: no suitable method found for build()
        ProcessorTopology topology = builder.internalTopologyBuilder.build();
                                                                    ^
    method InternalTopologyBuilder.build(Set<String>) is not applicable
      (actual and formal argument lists differ in length)
    method InternalTopologyBuilder.build(Integer) is not applicable
      (actual and formal argument lists differ in length)
<https://builds.apache.org/job/kafka-1.0-jdk7/ws/streams/src/test/java/org/apache/kafka/streams/StreamsBuilderTest.java>:104:
error: no suitable method found for build()
        ProcessorTopology topology = builder.internalTopologyBuilder.build();
                                                                    ^
    method InternalTopologyBuilder.build(Set<String>) is not applicable
      (actual and formal argument lists differ in length)
    method InternalTopologyBuilder.build(Integer) is not applicable
      (actual and formal argument lists differ in length)
<https://builds.apache.org/job/kafka-1.0-jdk7/ws/streams/src/test/java/org/apache/kafka/streams/StreamsBuilderTest.java>:119:
error: no suitable method found for build()
        ProcessorTopology topology = builder.internalTopologyBuilder.build();
                                                                    ^
    method InternalTopologyBuilder.build(Set<String>) is not applicable
      (actual and formal argument lists differ in length)
    method InternalTopologyBuilder.build(Integer) is not applicable
      (actual and formal argument lists differ in length)
<https://builds.apache.org/job/kafka-1.0-jdk7/ws/streams/src/test/java/org/apache/kafka/streams/StreamsBuilderTest.java>:134:
error: no suitable method found for build()
        ProcessorTopology topology = builder.internalTopologyBuilder.build();
                                                                    ^
    method InternalTopologyBuilder.build(Set<String>) is not applicable
      (actual and formal argument lists differ in length)
    method InternalTopologyBuilder.build(Integer) is not applicable
      (actual and formal argument lists differ in length)
<https://builds.apache.org/job/kafka-1.0-jdk7/ws/streams/src/test/java/org/apache/kafka/streams/StreamsBuilderTest.java>:150:
error: no suitable method found for build()
        ProcessorTopology topology = builder.internalTopologyBuilder.build();
                                                                    ^
    method InternalTopologyBuilder.build(Set<String>) is not applicable
      (actual and formal argument lists differ in length)
    method InternalTopologyBuilder.build(Integer) is not applicable
      (actual and formal argument lists differ in length)
<https://builds.apache.org/job/kafka-1.0-jdk7/ws/streams/src/test/java/org/apache/kafka/streams/StreamsBuilderTest.java>:164:
error: no suitable method found for build()
        ProcessorTopology topology = builder.internalTopologyBuilder.build();
                                                                    ^
    method InternalTopologyBuilder.build(Set<String>) is not applicable
      (actual and formal argument lists differ in length)
    method InternalTopologyBuilder.build(Integer) is not applicable
      (actual and formal argument lists differ in length)
Note: Some input files use or override a deprecated API.
Note: Recompile with -Xlint:deprecation for details.
Note: Some input files use unchecked or unsafe operations.
Note: Recompile with -Xlint:unchecked for details.
7 errors
 FAILED

FAILURE: Build failed with an exception.

* What went wrong:
Execution failed for task ':streams:compileTestJava'.
> Compilation failed; see the compiler error output for details.

* Try:
Run with --stacktrace option to get the stack trace. Run with --info or --debug option to
get more log output.

* Get more help at https://help.gradle.org

BUILD FAILED in 56m 6s
48 actionable tasks: 27 executed, 21 up-to-date
Build step 'Execute shell' marked build as failure
[FINDBUGS] Collecting findbugs analysis files...
ERROR: No tool found matching GRADLE_3_4_RC_2_HOME
Setting GRADLE_3_5_HOME=/home/jenkins/tools/gradle/3.5
[FINDBUGS] Searching for all files in <https://builds.apache.org/job/kafka-1.0-jdk7/ws/>
that match the pattern **/build/reports/findbugs/*.xml
[FINDBUGS] Parsing 4 files in <https://builds.apache.org/job/kafka-1.0-jdk7/ws/>
[FINDBUGS] Successfully parsed file <https://builds.apache.org/job/kafka-1.0-jdk7/ws/clients/build/reports/findbugs/main.xml>
with 0 unique warnings and 0 duplicates.
[FINDBUGS] Successfully parsed file <https://builds.apache.org/job/kafka-1.0-jdk7/ws/core/build/reports/findbugs/main.xml>
with 0 unique warnings and 0 duplicates.
[FINDBUGS] Successfully parsed file <https://builds.apache.org/job/kafka-1.0-jdk7/ws/examples/build/reports/findbugs/main.xml>
with 0 unique warnings and 0 duplicates.
[FINDBUGS] Successfully parsed file <https://builds.apache.org/job/kafka-1.0-jdk7/ws/log4j-appender/build/reports/findbugs/main.xml>
with 0 unique warnings and 0 duplicates.
ERROR: No tool found matching GRADLE_3_4_RC_2_HOME
Setting GRADLE_3_5_HOME=/home/jenkins/tools/gradle/3.5
ERROR: No tool found matching GRADLE_3_4_RC_2_HOME
Setting GRADLE_3_5_HOME=/home/jenkins/tools/gradle/3.5
<Git Blamer> Using GitBlamer to create author and commit information for all warnings.
<Git Blamer> GIT_COMMIT=5d17ae182806dd2d15c532c31f7127673eeaa9a2, workspace=<https://builds.apache.org/job/kafka-1.0-jdk7/ws/>
[FINDBUGS] Computing warning deltas based on reference build #126
Recording test results
ERROR: No tool found matching GRADLE_3_4_RC_2_HOME
Setting GRADLE_3_5_HOME=/home/jenkins/tools/gradle/3.5
ERROR: No tool found matching GRADLE_3_4_RC_2_HOME
Setting GRADLE_3_5_HOME=/home/jenkins/tools/gradle/3.5
Not sending mail to unregistered user wangguoz@gmail.com

Mime
View raw message