kafka-dev mailing list archives

Site index · List index
Message view « Date » · « Thread »
Top « Date » · « Thread »
From Apache Jenkins Server <jenk...@builds.apache.org>
Subject Build failed in Jenkins: kafka-trunk-jdk7 #3117
Date Thu, 25 Jan 2018 20:29:01 GMT
See <https://builds.apache.org/job/kafka-trunk-jdk7/3117/display/redirect?page=changes>

Changes:

[jason] KAFKA-6429; LogCleanerManager.cleanableOffsets should create objects …

------------------------------------------
[...truncated 404.19 KB...]

kafka.api.PlaintextConsumerTest > testCommitMetadata STARTED

kafka.api.PlaintextConsumerTest > testCommitMetadata PASSED

kafka.api.PlaintextConsumerTest > testHeadersExtendedSerializerDeserializer STARTED

kafka.api.PlaintextConsumerTest > testHeadersExtendedSerializerDeserializer PASSED

kafka.api.PlaintextConsumerTest > testRoundRobinAssignment STARTED

kafka.api.PlaintextConsumerTest > testRoundRobinAssignment PASSED

kafka.api.PlaintextConsumerTest > testPatternSubscription STARTED

kafka.api.PlaintextConsumerTest > testPatternSubscription PASSED

kafka.api.PlaintextConsumerTest > testCoordinatorFailover STARTED

kafka.api.PlaintextConsumerTest > testCoordinatorFailover PASSED

kafka.api.PlaintextConsumerTest > testSimpleConsumption STARTED

kafka.api.PlaintextConsumerTest > testSimpleConsumption PASSED

kafka.api.SslConsumerTest > testCoordinatorFailover STARTED

kafka.api.SslConsumerTest > testCoordinatorFailover PASSED

kafka.api.SslConsumerTest > testSimpleConsumption STARTED

kafka.api.SslConsumerTest > testSimpleConsumption PASSED

kafka.api.SaslClientsWithInvalidCredentialsTest > testTransactionalProducerWithAuthenticationFailure
STARTED

kafka.api.SaslClientsWithInvalidCredentialsTest > testTransactionalProducerWithAuthenticationFailure
PASSED

kafka.api.SaslClientsWithInvalidCredentialsTest > testManualAssignmentConsumerWithAuthenticationFailure
STARTED

kafka.api.SaslClientsWithInvalidCredentialsTest > testManualAssignmentConsumerWithAuthenticationFailure
PASSED

kafka.api.SaslClientsWithInvalidCredentialsTest > testProducerWithAuthenticationFailure
STARTED

kafka.api.SaslClientsWithInvalidCredentialsTest > testProducerWithAuthenticationFailure
PASSED

kafka.api.SaslClientsWithInvalidCredentialsTest > testConsumerGroupServiceWithAuthenticationFailure
STARTED

kafka.api.SaslClientsWithInvalidCredentialsTest > testConsumerGroupServiceWithAuthenticationFailure
PASSED

kafka.api.SaslClientsWithInvalidCredentialsTest > testManualAssignmentConsumerWithAutoCommitDisabledWithAuthenticationFailure
STARTED

kafka.api.SaslClientsWithInvalidCredentialsTest > testManualAssignmentConsumerWithAutoCommitDisabledWithAuthenticationFailure
PASSED

kafka.api.SaslClientsWithInvalidCredentialsTest > testKafkaAdminClientWithAuthenticationFailure
STARTED

kafka.api.SaslClientsWithInvalidCredentialsTest > testKafkaAdminClientWithAuthenticationFailure
PASSED

kafka.api.SaslClientsWithInvalidCredentialsTest > testConsumerWithAuthenticationFailure
STARTED

kafka.api.SaslClientsWithInvalidCredentialsTest > testConsumerWithAuthenticationFailure
PASSED

kafka.api.DelegationTokenEndToEndAuthorizationTest > testNoConsumeWithoutDescribeAclViaSubscribe
STARTED

kafka.api.DelegationTokenEndToEndAuthorizationTest > testNoConsumeWithoutDescribeAclViaSubscribe
PASSED

kafka.api.DelegationTokenEndToEndAuthorizationTest > testProduceConsumeViaAssign STARTED

kafka.api.DelegationTokenEndToEndAuthorizationTest > testProduceConsumeViaAssign PASSED

kafka.api.DelegationTokenEndToEndAuthorizationTest > testNoConsumeWithDescribeAclViaAssign
STARTED

kafka.api.DelegationTokenEndToEndAuthorizationTest > testNoConsumeWithDescribeAclViaAssign
PASSED

kafka.api.DelegationTokenEndToEndAuthorizationTest > testNoConsumeWithDescribeAclViaSubscribe
STARTED

kafka.api.DelegationTokenEndToEndAuthorizationTest > testNoConsumeWithDescribeAclViaSubscribe
PASSED

kafka.api.DelegationTokenEndToEndAuthorizationTest > testNoConsumeWithoutDescribeAclViaAssign
STARTED

kafka.api.DelegationTokenEndToEndAuthorizationTest > testNoConsumeWithoutDescribeAclViaAssign
PASSED

kafka.api.DelegationTokenEndToEndAuthorizationTest > testNoGroupAcl STARTED

kafka.api.DelegationTokenEndToEndAuthorizationTest > testNoGroupAcl PASSED

kafka.api.DelegationTokenEndToEndAuthorizationTest > testNoProduceWithDescribeAcl STARTED

kafka.api.DelegationTokenEndToEndAuthorizationTest > testNoProduceWithDescribeAcl PASSED

kafka.api.DelegationTokenEndToEndAuthorizationTest > testProduceConsumeViaSubscribe STARTED

kafka.api.DelegationTokenEndToEndAuthorizationTest > testProduceConsumeViaSubscribe PASSED

kafka.api.DelegationTokenEndToEndAuthorizationTest > testNoProduceWithoutDescribeAcl STARTED

kafka.api.DelegationTokenEndToEndAuthorizationTest > testNoProduceWithoutDescribeAcl PASSED

kafka.api.SaslGssapiSslEndToEndAuthorizationTest > testTwoConsumersWithDifferentSaslCredentials
STARTED

kafka.api.SaslGssapiSslEndToEndAuthorizationTest > testTwoConsumersWithDifferentSaslCredentials
PASSED

kafka.api.SaslGssapiSslEndToEndAuthorizationTest > testNoConsumeWithoutDescribeAclViaSubscribe
STARTED

kafka.api.SaslGssapiSslEndToEndAuthorizationTest > testNoConsumeWithoutDescribeAclViaSubscribe
PASSED

kafka.api.SaslGssapiSslEndToEndAuthorizationTest > testProduceConsumeViaAssign STARTED

kafka.api.SaslGssapiSslEndToEndAuthorizationTest > testProduceConsumeViaAssign PASSED

kafka.api.SaslGssapiSslEndToEndAuthorizationTest > testNoConsumeWithDescribeAclViaAssign
STARTED

kafka.api.SaslGssapiSslEndToEndAuthorizationTest > testNoConsumeWithDescribeAclViaAssign
PASSED

kafka.api.SaslGssapiSslEndToEndAuthorizationTest > testNoConsumeWithDescribeAclViaSubscribe
STARTED

kafka.api.SaslGssapiSslEndToEndAuthorizationTest > testNoConsumeWithDescribeAclViaSubscribe
PASSED

kafka.api.SaslGssapiSslEndToEndAuthorizationTest > testNoConsumeWithoutDescribeAclViaAssign
STARTED

kafka.api.SaslGssapiSslEndToEndAuthorizationTest > testNoConsumeWithoutDescribeAclViaAssign
PASSED

kafka.api.SaslGssapiSslEndToEndAuthorizationTest > testNoGroupAcl STARTED

kafka.api.SaslGssapiSslEndToEndAuthorizationTest > testNoGroupAcl PASSED

kafka.api.SaslGssapiSslEndToEndAuthorizationTest > testNoProduceWithDescribeAcl STARTED

kafka.api.SaslGssapiSslEndToEndAuthorizationTest > testNoProduceWithDescribeAcl PASSED

kafka.api.SaslGssapiSslEndToEndAuthorizationTest > testProduceConsumeViaSubscribe STARTED

kafka.api.SaslGssapiSslEndToEndAuthorizationTest > testProduceConsumeViaSubscribe PASSED

kafka.api.SaslGssapiSslEndToEndAuthorizationTest > testNoProduceWithoutDescribeAcl STARTED

kafka.api.SaslGssapiSslEndToEndAuthorizationTest > testNoProduceWithoutDescribeAcl PASSED

kafka.api.TransactionsTest > testBasicTransactions STARTED

kafka.api.TransactionsTest > testBasicTransactions PASSED

kafka.api.TransactionsTest > testFencingOnSendOffsets STARTED

kafka.api.TransactionsTest > testFencingOnSendOffsets PASSED

kafka.api.TransactionsTest > testFencingOnAddPartitions STARTED

kafka.api.TransactionsTest > testFencingOnAddPartitions PASSED

kafka.api.TransactionsTest > testFencingOnTransactionExpiration STARTED

kafka.api.TransactionsTest > testFencingOnTransactionExpiration PASSED

kafka.api.TransactionsTest > testDelayedFetchIncludesAbortedTransaction STARTED

kafka.api.TransactionsTest > testDelayedFetchIncludesAbortedTransaction PASSED

kafka.api.TransactionsTest > testReadCommittedConsumerShouldNotSeeUndecidedData STARTED

kafka.api.TransactionsTest > testReadCommittedConsumerShouldNotSeeUndecidedData PASSED

kafka.api.TransactionsTest > testFencingOnSend STARTED

kafka.api.TransactionsTest > testFencingOnSend PASSED

kafka.api.TransactionsTest > testFencingOnCommit STARTED

kafka.api.TransactionsTest > testFencingOnCommit PASSED

kafka.api.TransactionsTest > testMultipleMarkersOneLeader STARTED

kafka.api.TransactionsTest > testMultipleMarkersOneLeader PASSED

kafka.api.TransactionsTest > testSendOffsets STARTED

kafka.api.TransactionsTest > testSendOffsets PASSED

kafka.api.PlaintextEndToEndAuthorizationTest > testNoConsumeWithoutDescribeAclViaSubscribe
STARTED

kafka.api.PlaintextEndToEndAuthorizationTest > testNoConsumeWithoutDescribeAclViaSubscribe
PASSED

kafka.api.PlaintextEndToEndAuthorizationTest > testProduceConsumeViaAssign STARTED

kafka.api.PlaintextEndToEndAuthorizationTest > testProduceConsumeViaAssign PASSED

kafka.api.PlaintextEndToEndAuthorizationTest > testNoConsumeWithDescribeAclViaAssign STARTED

kafka.api.PlaintextEndToEndAuthorizationTest > testNoConsumeWithDescribeAclViaAssign PASSED

kafka.api.PlaintextEndToEndAuthorizationTest > testNoConsumeWithDescribeAclViaSubscribe
STARTED

kafka.api.PlaintextEndToEndAuthorizationTest > testNoConsumeWithDescribeAclViaSubscribe
PASSED

kafka.api.PlaintextEndToEndAuthorizationTest > testNoConsumeWithoutDescribeAclViaAssign
STARTED

kafka.api.PlaintextEndToEndAuthorizationTest > testNoConsumeWithoutDescribeAclViaAssign
PASSED

kafka.api.PlaintextEndToEndAuthorizationTest > testNoGroupAcl STARTED

kafka.api.PlaintextEndToEndAuthorizationTest > testNoGroupAcl PASSED

kafka.api.PlaintextEndToEndAuthorizationTest > testNoProduceWithDescribeAcl STARTED

kafka.api.PlaintextEndToEndAuthorizationTest > testNoProduceWithDescribeAcl PASSED

kafka.api.PlaintextEndToEndAuthorizationTest > testProduceConsumeViaSubscribe STARTED

kafka.api.PlaintextEndToEndAuthorizationTest > testProduceConsumeViaSubscribe PASSED

kafka.api.PlaintextEndToEndAuthorizationTest > testNoProduceWithoutDescribeAcl STARTED

kafka.api.PlaintextEndToEndAuthorizationTest > testNoProduceWithoutDescribeAcl PASSED

1804 tests completed, 1 failed, 6 skipped
:kafka-trunk-jdk7:core:test FAILED
:test_core_2_11 FAILED

FAILURE: Build failed with an exception.

* What went wrong:
Execution failed for task ':kafka-trunk-jdk7:core:test'.
> There were failing tests. See the report at: file://<https://builds.apache.org/job/kafka-trunk-jdk7/ws/core/build/reports/tests/test/index.html>

* Try:
Run with --stacktrace option to get the stack trace. Run with --info or --debug option to
get more log output. Run with --scan to get full insights.

* Get more help at https://help.gradle.org

BUILD FAILED in 1h 21m 54s
16 actionable tasks: 13 executed, 3 up-to-date
Build step 'Execute shell' marked build as failure
[FINDBUGS] Collecting findbugs analysis files...
ERROR: No tool found matching GRADLE_3_4_RC_2_HOME
Setting GRADLE_3_5_HOME=/home/jenkins/tools/gradle/3.5
[FINDBUGS] Searching for all files in <https://builds.apache.org/job/kafka-trunk-jdk7/ws/>
that match the pattern **/build/reports/findbugs/*.xml
[FINDBUGS] Parsing 1 file in <https://builds.apache.org/job/kafka-trunk-jdk7/ws/>
[FINDBUGS] Successfully parsed file <https://builds.apache.org/job/kafka-trunk-jdk7/ws/core/build/reports/findbugs/main.xml>
with 0 unique warnings and 0 duplicates.
ERROR: No tool found matching GRADLE_3_4_RC_2_HOME
Setting GRADLE_3_5_HOME=/home/jenkins/tools/gradle/3.5
ERROR: No tool found matching GRADLE_3_4_RC_2_HOME
Setting GRADLE_3_5_HOME=/home/jenkins/tools/gradle/3.5
<Git Blamer> Using GitBlamer to create author and commit information for all warnings.
<Git Blamer> GIT_COMMIT=41e4e93b5ae8a7d221fce1733e050cb98ac9713c, workspace=<https://builds.apache.org/job/kafka-trunk-jdk7/ws/>
[FINDBUGS] Computing warning deltas based on reference build #3115
Recording test results
ERROR: No tool found matching GRADLE_3_4_RC_2_HOME
Setting GRADLE_3_5_HOME=/home/jenkins/tools/gradle/3.5
ERROR: No tool found matching GRADLE_3_4_RC_2_HOME
Setting GRADLE_3_5_HOME=/home/jenkins/tools/gradle/3.5

Mime
View raw message