kafka-dev mailing list archives

Site index · List index
Message view « Date » · « Thread »
Top « Date » · « Thread »
From Apache Jenkins Server <jenk...@builds.apache.org>
Subject Build failed in Jenkins: kafka-trunk-jdk9 #325
Date Tue, 23 Jan 2018 19:09:24 GMT
See <https://builds.apache.org/job/kafka-trunk-jdk9/325/display/redirect?page=changes>

Changes:

[jason] KAFKA-6241; Enable dynamic updates of broker SSL keystore (#4263)

------------------------------------------
[...truncated 1.45 MB...]
kafka.server.DelayedOperationTest > shouldCancelForKeyReturningCancelledOperations STARTED

kafka.server.DelayedOperationTest > shouldCancelForKeyReturningCancelledOperations PASSED

kafka.server.DelayedOperationTest > testRequestSatisfaction STARTED

kafka.server.DelayedOperationTest > testRequestSatisfaction PASSED

kafka.server.DelayedOperationTest > testDelayedOperationLock STARTED

kafka.server.DelayedOperationTest > testDelayedOperationLock PASSED

kafka.zookeeper.ZooKeeperClientTest > testZNodeChangeHandlerForDataChange STARTED

kafka.zookeeper.ZooKeeperClientTest > testZNodeChangeHandlerForDataChange PASSED

kafka.zookeeper.ZooKeeperClientTest > testZooKeeperSessionStateMetric STARTED

kafka.zookeeper.ZooKeeperClientTest > testZooKeeperSessionStateMetric PASSED

kafka.zookeeper.ZooKeeperClientTest > testGetChildrenExistingZNode STARTED

kafka.zookeeper.ZooKeeperClientTest > testGetChildrenExistingZNode PASSED

kafka.zookeeper.ZooKeeperClientTest > testConnection STARTED

kafka.zookeeper.ZooKeeperClientTest > testConnection PASSED

kafka.zookeeper.ZooKeeperClientTest > testZNodeChangeHandlerForCreation STARTED

kafka.zookeeper.ZooKeeperClientTest > testZNodeChangeHandlerForCreation PASSED

kafka.zookeeper.ZooKeeperClientTest > testGetAclExistingZNode STARTED

kafka.zookeeper.ZooKeeperClientTest > testGetAclExistingZNode PASSED

kafka.zookeeper.ZooKeeperClientTest > testSetAclNonExistentZNode STARTED

kafka.zookeeper.ZooKeeperClientTest > testSetAclNonExistentZNode PASSED

kafka.zookeeper.ZooKeeperClientTest > testConnectionLossRequestTermination STARTED

kafka.zookeeper.ZooKeeperClientTest > testConnectionLossRequestTermination PASSED

kafka.zookeeper.ZooKeeperClientTest > testExistsNonExistentZNode STARTED

kafka.zookeeper.ZooKeeperClientTest > testExistsNonExistentZNode PASSED

kafka.zookeeper.ZooKeeperClientTest > testGetDataNonExistentZNode STARTED

kafka.zookeeper.ZooKeeperClientTest > testGetDataNonExistentZNode PASSED

kafka.zookeeper.ZooKeeperClientTest > testConnectionTimeout STARTED

kafka.zookeeper.ZooKeeperClientTest > testConnectionTimeout PASSED

kafka.zookeeper.ZooKeeperClientTest > testUnresolvableConnectString STARTED

kafka.zookeeper.ZooKeeperClientTest > testUnresolvableConnectString PASSED

kafka.zookeeper.ZooKeeperClientTest > testGetChildrenNonExistentZNode STARTED

kafka.zookeeper.ZooKeeperClientTest > testGetChildrenNonExistentZNode PASSED

kafka.zookeeper.ZooKeeperClientTest > testPipelinedGetData STARTED

kafka.zookeeper.ZooKeeperClientTest > testPipelinedGetData PASSED

kafka.zookeeper.ZooKeeperClientTest > testZNodeChildChangeHandlerForChildChange STARTED

kafka.zookeeper.ZooKeeperClientTest > testZNodeChildChangeHandlerForChildChange PASSED

kafka.zookeeper.ZooKeeperClientTest > testGetChildrenExistingZNodeWithChildren STARTED

kafka.zookeeper.ZooKeeperClientTest > testGetChildrenExistingZNodeWithChildren PASSED

kafka.zookeeper.ZooKeeperClientTest > testSetDataExistingZNode STARTED

kafka.zookeeper.ZooKeeperClientTest > testSetDataExistingZNode PASSED

kafka.zookeeper.ZooKeeperClientTest > testMixedPipeline STARTED

kafka.zookeeper.ZooKeeperClientTest > testMixedPipeline PASSED

kafka.zookeeper.ZooKeeperClientTest > testGetDataExistingZNode STARTED

kafka.zookeeper.ZooKeeperClientTest > testGetDataExistingZNode PASSED

kafka.zookeeper.ZooKeeperClientTest > testDeleteExistingZNode STARTED

kafka.zookeeper.ZooKeeperClientTest > testDeleteExistingZNode PASSED

kafka.zookeeper.ZooKeeperClientTest > testSetDataNonExistentZNode STARTED

kafka.zookeeper.ZooKeeperClientTest > testSetDataNonExistentZNode PASSED

kafka.zookeeper.ZooKeeperClientTest > testDeleteNonExistentZNode STARTED

kafka.zookeeper.ZooKeeperClientTest > testDeleteNonExistentZNode PASSED

kafka.zookeeper.ZooKeeperClientTest > testExistsExistingZNode STARTED

kafka.zookeeper.ZooKeeperClientTest > testExistsExistingZNode PASSED

kafka.zookeeper.ZooKeeperClientTest > testZooKeeperStateChangeRateMetrics STARTED

kafka.zookeeper.ZooKeeperClientTest > testZooKeeperStateChangeRateMetrics PASSED

kafka.zookeeper.ZooKeeperClientTest > testZNodeChangeHandlerForDeletion STARTED

kafka.zookeeper.ZooKeeperClientTest > testZNodeChangeHandlerForDeletion PASSED

kafka.zookeeper.ZooKeeperClientTest > testGetAclNonExistentZNode STARTED

kafka.zookeeper.ZooKeeperClientTest > testGetAclNonExistentZNode PASSED

kafka.zookeeper.ZooKeeperClientTest > testStateChangeHandlerForAuthFailure STARTED

kafka.zookeeper.ZooKeeperClientTest > testStateChangeHandlerForAuthFailure PASSED

kafka.network.SocketServerTest > testGracefulClose STARTED

kafka.network.SocketServerTest > testGracefulClose PASSED

kafka.network.SocketServerTest > controlThrowable STARTED

kafka.network.SocketServerTest > controlThrowable PASSED

kafka.network.SocketServerTest > testRequestMetricsAfterStop STARTED

kafka.network.SocketServerTest > testRequestMetricsAfterStop PASSED

kafka.network.SocketServerTest > testConnectionIdReuse STARTED

kafka.network.SocketServerTest > testConnectionIdReuse PASSED

kafka.network.SocketServerTest > testClientDisconnectionUpdatesRequestMetrics STARTED

kafka.network.SocketServerTest > testClientDisconnectionUpdatesRequestMetrics PASSED

kafka.network.SocketServerTest > testProcessorMetricsTags STARTED

kafka.network.SocketServerTest > testProcessorMetricsTags PASSED

kafka.network.SocketServerTest > testMaxConnectionsPerIp STARTED

kafka.network.SocketServerTest > testMaxConnectionsPerIp PASSED

kafka.network.SocketServerTest > testConnectionId STARTED

kafka.network.SocketServerTest > testConnectionId PASSED

kafka.network.SocketServerTest > testBrokerSendAfterChannelClosedUpdatesRequestMetrics
STARTED

kafka.network.SocketServerTest > testBrokerSendAfterChannelClosedUpdatesRequestMetrics
PASSED

kafka.network.SocketServerTest > testNoOpAction STARTED

kafka.network.SocketServerTest > testNoOpAction PASSED

kafka.network.SocketServerTest > simpleRequest STARTED

kafka.network.SocketServerTest > simpleRequest PASSED

kafka.network.SocketServerTest > closingChannelException STARTED

kafka.network.SocketServerTest > closingChannelException PASSED

kafka.network.SocketServerTest > testIdleConnection STARTED

kafka.network.SocketServerTest > testIdleConnection PASSED

kafka.network.SocketServerTest > testMetricCollectionAfterShutdown STARTED

kafka.network.SocketServerTest > testMetricCollectionAfterShutdown PASSED

kafka.network.SocketServerTest > testSessionPrincipal STARTED

kafka.network.SocketServerTest > testSessionPrincipal PASSED

kafka.network.SocketServerTest > configureNewConnectionException STARTED

kafka.network.SocketServerTest > configureNewConnectionException PASSED

kafka.network.SocketServerTest > testMaxConnectionsPerIpOverrides STARTED

kafka.network.SocketServerTest > testMaxConnectionsPerIpOverrides PASSED

kafka.network.SocketServerTest > processNewResponseException STARTED

kafka.network.SocketServerTest > processNewResponseException PASSED

kafka.network.SocketServerTest > processCompletedSendException STARTED

kafka.network.SocketServerTest > processCompletedSendException PASSED

kafka.network.SocketServerTest > processDisconnectedException STARTED

kafka.network.SocketServerTest > processDisconnectedException PASSED

kafka.network.SocketServerTest > sendCancelledKeyException STARTED

kafka.network.SocketServerTest > sendCancelledKeyException PASSED

kafka.network.SocketServerTest > processCompletedReceiveException STARTED

kafka.network.SocketServerTest > processCompletedReceiveException PASSED

kafka.network.SocketServerTest > testSocketsCloseOnShutdown STARTED

kafka.network.SocketServerTest > testSocketsCloseOnShutdown PASSED

kafka.network.SocketServerTest > pollException STARTED

kafka.network.SocketServerTest > pollException PASSED

kafka.network.SocketServerTest > testSslSocketServer STARTED

kafka.network.SocketServerTest > testSslSocketServer PASSED

kafka.network.SocketServerTest > tooBigRequestIsRejected STARTED

kafka.network.SocketServerTest > tooBigRequestIsRejected PASSED

1799 tests completed, 1 failed, 6 skipped
:core:test FAILED

FAILURE: Build failed with an exception.

* What went wrong:
Execution failed for task ':core:test'.
> There were failing tests. See the report at: file://<https://builds.apache.org/job/kafka-trunk-jdk9/ws/core/build/reports/tests/test/index.html>

* Try:
Run with --stacktrace option to get the stack trace. Run with --info or --debug option to
get more log output. Run with --scan to get full insights.

* Get more help at https://help.gradle.org

BUILD FAILED in 1h 24m 28s
29 actionable tasks: 28 executed, 1 up-to-date
Build step 'Execute shell' marked build as failure
Recording test results
ERROR: No tool found matching GRADLE_3_4_RC_2_HOME
Setting GRADLE_4_3_HOME=/home/jenkins/tools/gradle/4.3
ERROR: No tool found matching GRADLE_3_4_RC_2_HOME
Setting GRADLE_4_3_HOME=/home/jenkins/tools/gradle/4.3
Not sending mail to unregistered user github@alasdairhodge.co.uk
Not sending mail to unregistered user rajinisivaram@googlemail.com
Not sending mail to unregistered user wangguoz@gmail.com

Mime
View raw message