kafka-dev mailing list archives

Site index · List index
Message view « Date » · « Thread »
Top « Date » · « Thread »
From Apache Jenkins Server <jenk...@builds.apache.org>
Subject Build failed in Jenkins: kafka-0.10.2-jdk7 #200
Date Fri, 22 Dec 2017 11:50:35 GMT
See <https://builds.apache.org/job/kafka-0.10.2-jdk7/200/display/redirect>

------------------------------------------
[...truncated 326.91 KB...]

kafka.coordinator.GroupMetadataTest > testInitNextGenerationEmptyGroup STARTED

kafka.coordinator.GroupMetadataTest > testInitNextGenerationEmptyGroup PASSED

kafka.coordinator.GroupMetadataTest > testCannotRebalanceWhenDead STARTED

kafka.coordinator.GroupMetadataTest > testCannotRebalanceWhenDead PASSED

kafka.coordinator.GroupMetadataTest > testInitNextGeneration STARTED

kafka.coordinator.GroupMetadataTest > testInitNextGeneration PASSED

kafka.coordinator.GroupMetadataTest > testPreparingRebalanceToEmptyTransition STARTED

kafka.coordinator.GroupMetadataTest > testPreparingRebalanceToEmptyTransition PASSED

kafka.coordinator.GroupMetadataTest > testSelectProtocol STARTED

kafka.coordinator.GroupMetadataTest > testSelectProtocol PASSED

kafka.coordinator.GroupMetadataTest > testCannotRebalanceWhenPreparingRebalance STARTED

kafka.coordinator.GroupMetadataTest > testCannotRebalanceWhenPreparingRebalance PASSED

kafka.coordinator.GroupMetadataTest > testDeadToPreparingRebalanceIllegalTransition STARTED

kafka.coordinator.GroupMetadataTest > testDeadToPreparingRebalanceIllegalTransition PASSED

kafka.coordinator.GroupMetadataTest > testCanRebalanceWhenAwaitingSync STARTED

kafka.coordinator.GroupMetadataTest > testCanRebalanceWhenAwaitingSync PASSED

kafka.coordinator.GroupMetadataTest > testAwaitingSyncToPreparingRebalanceTransition STARTED

kafka.coordinator.GroupMetadataTest > testAwaitingSyncToPreparingRebalanceTransition PASSED

kafka.coordinator.GroupMetadataTest > testStableToAwaitingSyncIllegalTransition STARTED

kafka.coordinator.GroupMetadataTest > testStableToAwaitingSyncIllegalTransition PASSED

kafka.coordinator.GroupMetadataTest > testEmptyToDeadTransition STARTED

kafka.coordinator.GroupMetadataTest > testEmptyToDeadTransition PASSED

kafka.coordinator.GroupMetadataTest > testSelectProtocolRaisesIfNoMembers STARTED

kafka.coordinator.GroupMetadataTest > testSelectProtocolRaisesIfNoMembers PASSED

kafka.coordinator.GroupMetadataTest > testStableToPreparingRebalanceTransition STARTED

kafka.coordinator.GroupMetadataTest > testStableToPreparingRebalanceTransition PASSED

kafka.coordinator.GroupMetadataTest > testPreparingRebalanceToDeadTransition STARTED

kafka.coordinator.GroupMetadataTest > testPreparingRebalanceToDeadTransition PASSED

kafka.coordinator.GroupMetadataTest > testStableToStableIllegalTransition STARTED

kafka.coordinator.GroupMetadataTest > testStableToStableIllegalTransition PASSED

kafka.coordinator.GroupMetadataTest > testAwaitingSyncToStableTransition STARTED

kafka.coordinator.GroupMetadataTest > testAwaitingSyncToStableTransition PASSED

kafka.coordinator.GroupMetadataTest > testOffsetCommitFailureWithAnotherPending STARTED

kafka.coordinator.GroupMetadataTest > testOffsetCommitFailureWithAnotherPending PASSED

kafka.coordinator.GroupMetadataTest > testDeadToStableIllegalTransition STARTED

kafka.coordinator.GroupMetadataTest > testDeadToStableIllegalTransition PASSED

kafka.coordinator.GroupMetadataTest > testOffsetCommit STARTED

kafka.coordinator.GroupMetadataTest > testOffsetCommit PASSED

kafka.coordinator.GroupMetadataTest > testAwaitingSyncToAwaitingSyncIllegalTransition STARTED

kafka.coordinator.GroupMetadataTest > testAwaitingSyncToAwaitingSyncIllegalTransition PASSED

kafka.coordinator.GroupMetadataTest > testSupportsProtocols STARTED

kafka.coordinator.GroupMetadataTest > testSupportsProtocols PASSED

kafka.coordinator.GroupMetadataTest > testCanRebalanceWhenStable STARTED

kafka.coordinator.GroupMetadataTest > testCanRebalanceWhenStable PASSED

kafka.coordinator.GroupMetadataTest > testOffsetCommitWithAnotherPending STARTED

kafka.coordinator.GroupMetadataTest > testOffsetCommitWithAnotherPending PASSED

kafka.coordinator.GroupMetadataTest > testPreparingRebalanceToPreparingRebalanceIllegalTransition
STARTED

kafka.coordinator.GroupMetadataTest > testPreparingRebalanceToPreparingRebalanceIllegalTransition
PASSED

kafka.coordinator.GroupMetadataTest > testSelectProtocolChoosesCompatibleProtocol STARTED

kafka.coordinator.GroupMetadataTest > testSelectProtocolChoosesCompatibleProtocol PASSED

kafka.coordinator.GroupCoordinatorTest > testOffsetsRetentionMsIntegerOverflow STARTED

kafka.coordinator.GroupCoordinatorTest > testOffsetsRetentionMsIntegerOverflow PASSED

kafka.coordinator.MemberMetadataTest > testMatchesSupportedProtocols STARTED

kafka.coordinator.MemberMetadataTest > testMatchesSupportedProtocols PASSED

kafka.coordinator.MemberMetadataTest > testMetadata STARTED

kafka.coordinator.MemberMetadataTest > testMetadata PASSED

kafka.coordinator.MemberMetadataTest > testMetadataRaisesOnUnsupportedProtocol STARTED

kafka.coordinator.MemberMetadataTest > testMetadataRaisesOnUnsupportedProtocol PASSED

kafka.coordinator.MemberMetadataTest > testVoteForPreferredProtocol STARTED

kafka.coordinator.MemberMetadataTest > testVoteForPreferredProtocol PASSED

kafka.coordinator.MemberMetadataTest > testVoteRaisesOnNoSupportedProtocols STARTED

kafka.coordinator.MemberMetadataTest > testVoteRaisesOnNoSupportedProtocols PASSED

kafka.coordinator.GroupMetadataManagerTest > testStoreNonEmptyGroup STARTED

kafka.coordinator.GroupMetadataManagerTest > testStoreNonEmptyGroup PASSED

kafka.coordinator.GroupMetadataManagerTest > testLoadOffsetsWithTombstones STARTED

kafka.coordinator.GroupMetadataManagerTest > testLoadOffsetsWithTombstones PASSED

kafka.coordinator.GroupMetadataManagerTest > testLoadOffsetsWithoutGroup STARTED

kafka.coordinator.GroupMetadataManagerTest > testLoadOffsetsWithoutGroup PASSED

kafka.coordinator.GroupMetadataManagerTest > testAddGroup STARTED

kafka.coordinator.GroupMetadataManagerTest > testAddGroup PASSED

kafka.coordinator.GroupMetadataManagerTest > testGroupMetadataRemovalWithLogAppendTime
STARTED

kafka.coordinator.GroupMetadataManagerTest > testGroupMetadataRemovalWithLogAppendTime
PASSED

kafka.coordinator.GroupMetadataManagerTest > testOffsetWriteAfterGroupRemoved STARTED

kafka.coordinator.GroupMetadataManagerTest > testOffsetWriteAfterGroupRemoved PASSED

kafka.coordinator.GroupMetadataManagerTest > testCommitOffsetWhenCoordinatorHasMoved STARTED

kafka.coordinator.GroupMetadataManagerTest > testCommitOffsetWhenCoordinatorHasMoved PASSED

kafka.coordinator.GroupMetadataManagerTest > testStoreNonEmptyGroupWhenCoordinatorHasMoved
STARTED

kafka.coordinator.GroupMetadataManagerTest > testStoreNonEmptyGroupWhenCoordinatorHasMoved
PASSED

kafka.coordinator.GroupMetadataManagerTest > testCommitOffset STARTED

kafka.coordinator.GroupMetadataManagerTest > testCommitOffset PASSED

kafka.coordinator.GroupMetadataManagerTest > testGroupMetadataRemoval STARTED

kafka.coordinator.GroupMetadataManagerTest > testGroupMetadataRemoval PASSED

kafka.coordinator.GroupMetadataManagerTest > testLoadGroupWithTombstone STARTED

kafka.coordinator.GroupMetadataManagerTest > testLoadGroupWithTombstone PASSED

kafka.coordinator.GroupMetadataManagerTest > testLoadOffsetsAndGroup STARTED

kafka.coordinator.GroupMetadataManagerTest > testLoadOffsetsAndGroup PASSED

kafka.coordinator.GroupMetadataManagerTest > testStoreGroupErrorMapping STARTED

kafka.coordinator.GroupMetadataManagerTest > testStoreGroupErrorMapping PASSED

kafka.coordinator.GroupMetadataManagerTest > testCommitOffsetFailure STARTED

kafka.coordinator.GroupMetadataManagerTest > testCommitOffsetFailure PASSED

kafka.coordinator.GroupMetadataManagerTest > testExpireOffset STARTED

kafka.coordinator.GroupMetadataManagerTest > testExpireOffset PASSED

kafka.coordinator.GroupMetadataManagerTest > testExpireOffsetsWithActiveGroup STARTED

kafka.coordinator.GroupMetadataManagerTest > testExpireOffsetsWithActiveGroup PASSED

kafka.coordinator.GroupMetadataManagerTest > testExpireGroupWithOffsetsOnly STARTED

kafka.coordinator.GroupMetadataManagerTest > testExpireGroupWithOffsetsOnly PASSED

kafka.coordinator.GroupMetadataManagerTest > testStoreEmptyGroup STARTED

kafka.coordinator.GroupMetadataManagerTest > testStoreEmptyGroup PASSED

kafka.javaapi.message.ByteBufferMessageSetTest > testSizeInBytesWithCompression STARTED

kafka.javaapi.message.ByteBufferMessageSetTest > testSizeInBytesWithCompression PASSED

kafka.javaapi.message.ByteBufferMessageSetTest > testIteratorIsConsistentWithCompression
STARTED

kafka.javaapi.message.ByteBufferMessageSetTest > testIteratorIsConsistentWithCompression
PASSED

kafka.javaapi.message.ByteBufferMessageSetTest > testIteratorIsConsistent STARTED

kafka.javaapi.message.ByteBufferMessageSetTest > testIteratorIsConsistent PASSED

kafka.javaapi.message.ByteBufferMessageSetTest > testEqualsWithCompression STARTED

kafka.javaapi.message.ByteBufferMessageSetTest > testEqualsWithCompression PASSED

kafka.javaapi.message.ByteBufferMessageSetTest > testWrittenEqualsRead STARTED

kafka.javaapi.message.ByteBufferMessageSetTest > testWrittenEqualsRead PASSED

kafka.javaapi.message.ByteBufferMessageSetTest > testEquals STARTED

kafka.javaapi.message.ByteBufferMessageSetTest > testEquals PASSED

kafka.javaapi.message.ByteBufferMessageSetTest > testSizeInBytes STARTED

kafka.javaapi.message.ByteBufferMessageSetTest > testSizeInBytes PASSED

kafka.javaapi.consumer.ZookeeperConsumerConnectorTest > testBasic STARTED

kafka.javaapi.consumer.ZookeeperConsumerConnectorTest > testBasic PASSED

1049 tests completed, 1 failed
:kafka-0.10.2-jdk7:core:test FAILED
:test_core_2_11 FAILED

FAILURE: Build failed with an exception.

* What went wrong:
Execution failed for task ':core:test'.
> There were failing tests. See the report at: file://<https://builds.apache.org/job/kafka-0.10.2-jdk7/ws/core/build/reports/tests/test/index.html>

* Try:
Run with --stacktrace option to get the stack trace. Run with --info or --debug option to
get more log output.

BUILD FAILED

Total time: 2 hrs 7 mins 54.141 secs
Build step 'Execute shell' marked build as failure
Recording test results
Setting GRADLE_2_4_RC_2_HOME=/home/jenkins/jenkins-slave/tools/hudson.plugins.gradle.GradleInstallation/Gradle_2.4-rc-2
Setting GRADLE_2_4_RC_2_HOME=/home/jenkins/jenkins-slave/tools/hudson.plugins.gradle.GradleInstallation/Gradle_2.4-rc-2

Mime
View raw message