kafka-dev mailing list archives

Site index · List index
Message view « Date » · « Thread »
Top « Date » · « Thread »
From Apache Jenkins Server <jenk...@builds.apache.org>
Subject Build failed in Jenkins: kafka-trunk-jdk7 #2984
Date Mon, 20 Nov 2017 20:40:32 GMT
See <https://builds.apache.org/job/kafka-trunk-jdk7/2984/display/redirect?page=changes>

Changes:

[wangguoz] KAFKA-6170; KIP-220 Part 1: Add AdminClient to Streams

------------------------------------------
[...truncated 383.84 KB...]
kafka.log.LogCleanerIntegrationTest > testCleansCombinedCompactAndDeleteTopic[0] PASSED

kafka.log.LogCleanerIntegrationTest > testCleaningNestedMessagesWithMultipleVersions[0]
STARTED

kafka.log.LogCleanerIntegrationTest > testCleaningNestedMessagesWithMultipleVersions[0]
PASSED

kafka.log.LogCleanerIntegrationTest > cleanerTest[0] STARTED

kafka.log.LogCleanerIntegrationTest > cleanerTest[0] PASSED

kafka.log.LogCleanerIntegrationTest > testCleanerWithMessageFormatV0[0] STARTED

kafka.log.LogCleanerIntegrationTest > testCleanerWithMessageFormatV0[0] PASSED

kafka.log.LogCleanerIntegrationTest > testCleansCombinedCompactAndDeleteTopic[1] STARTED

kafka.log.LogCleanerIntegrationTest > testCleansCombinedCompactAndDeleteTopic[1] PASSED

kafka.log.LogCleanerIntegrationTest > testCleaningNestedMessagesWithMultipleVersions[1]
STARTED

kafka.log.LogCleanerIntegrationTest > testCleaningNestedMessagesWithMultipleVersions[1]
PASSED

kafka.log.LogCleanerIntegrationTest > cleanerTest[1] STARTED

kafka.log.LogCleanerIntegrationTest > cleanerTest[1] PASSED

kafka.log.LogCleanerIntegrationTest > testCleanerWithMessageFormatV0[1] STARTED

kafka.log.LogCleanerIntegrationTest > testCleanerWithMessageFormatV0[1] PASSED

kafka.log.LogCleanerIntegrationTest > testCleansCombinedCompactAndDeleteTopic[2] STARTED

kafka.log.LogCleanerIntegrationTest > testCleansCombinedCompactAndDeleteTopic[2] PASSED

kafka.log.LogCleanerIntegrationTest > testCleaningNestedMessagesWithMultipleVersions[2]
STARTED

kafka.log.LogCleanerIntegrationTest > testCleaningNestedMessagesWithMultipleVersions[2]
PASSED

kafka.log.LogCleanerIntegrationTest > cleanerTest[2] STARTED
ERROR: Could not install GRADLE_3_4_RC_2_HOME
java.lang.NullPointerException
	at hudson.plugins.toolenv.ToolEnvBuildWrapper$1.buildEnvVars(ToolEnvBuildWrapper.java:46)
	at hudson.model.AbstractBuild.getEnvironment(AbstractBuild.java:887)
	at hudson.plugins.git.GitSCM.getParamExpandedRepos(GitSCM.java:421)
	at hudson.plugins.git.GitSCM.compareRemoteRevisionWithImpl(GitSCM.java:629)
	at hudson.plugins.git.GitSCM.compareRemoteRevisionWith(GitSCM.java:594)
	at hudson.scm.SCM.compareRemoteRevisionWith(SCM.java:391)
	at hudson.scm.SCM.poll(SCM.java:408)
	at hudson.model.AbstractProject._poll(AbstractProject.java:1394)
	at hudson.model.AbstractProject.poll(AbstractProject.java:1297)
	at hudson.triggers.SCMTrigger$Runner.runPolling(SCMTrigger.java:594)
	at hudson.triggers.SCMTrigger$Runner.run(SCMTrigger.java:640)
	at hudson.util.SequentialExecutionQueue$QueueEntry.run(SequentialExecutionQueue.java:119)
	at java.util.concurrent.Executors$RunnableAdapter.call(Executors.java:511)
	at java.util.concurrent.FutureTask.run(FutureTask.java:266)
	at java.util.concurrent.ThreadPoolExecutor.runWorker(ThreadPoolExecutor.java:1149)
	at java.util.concurrent.ThreadPoolExecutor$Worker.run(ThreadPoolExecutor.java:624)
	at java.lang.Thread.run(Thread.java:748)

kafka.log.LogCleanerIntegrationTest > cleanerTest[2] PASSED

kafka.log.LogCleanerIntegrationTest > testCleanerWithMessageFormatV0[2] STARTED

kafka.log.LogCleanerIntegrationTest > testCleanerWithMessageFormatV0[2] PASSED

kafka.log.LogCleanerIntegrationTest > testCleansCombinedCompactAndDeleteTopic[3] STARTED

kafka.log.LogCleanerIntegrationTest > testCleansCombinedCompactAndDeleteTopic[3] PASSED

kafka.log.LogCleanerIntegrationTest > testCleaningNestedMessagesWithMultipleVersions[3]
STARTED

kafka.log.LogCleanerIntegrationTest > testCleaningNestedMessagesWithMultipleVersions[3]
PASSED

kafka.log.LogCleanerIntegrationTest > cleanerTest[3] STARTED

kafka.log.LogCleanerIntegrationTest > cleanerTest[3] PASSED

kafka.log.LogCleanerIntegrationTest > testCleanerWithMessageFormatV0[3] STARTED

kafka.log.LogCleanerIntegrationTest > testCleanerWithMessageFormatV0[3] PASSED

kafka.log.ProducerStateManagerTest > testCoordinatorFencing STARTED

kafka.log.ProducerStateManagerTest > testCoordinatorFencing PASSED

kafka.log.ProducerStateManagerTest > testTruncate STARTED

kafka.log.ProducerStateManagerTest > testTruncate PASSED

kafka.log.ProducerStateManagerTest > testLoadFromTruncatedSnapshotFile STARTED

kafka.log.ProducerStateManagerTest > testLoadFromTruncatedSnapshotFile PASSED

kafka.log.ProducerStateManagerTest > testRemoveExpiredPidsOnReload STARTED

kafka.log.ProducerStateManagerTest > testRemoveExpiredPidsOnReload PASSED

kafka.log.ProducerStateManagerTest > testOutOfSequenceAfterControlRecordEpochBump STARTED

kafka.log.ProducerStateManagerTest > testOutOfSequenceAfterControlRecordEpochBump PASSED

kafka.log.ProducerStateManagerTest > testFirstUnstableOffsetAfterTruncation STARTED

kafka.log.ProducerStateManagerTest > testFirstUnstableOffsetAfterTruncation PASSED

kafka.log.ProducerStateManagerTest > testTakeSnapshot STARTED

kafka.log.ProducerStateManagerTest > testTakeSnapshot PASSED

kafka.log.ProducerStateManagerTest > testDeleteSnapshotsBefore STARTED

kafka.log.ProducerStateManagerTest > testDeleteSnapshotsBefore PASSED

kafka.log.ProducerStateManagerTest > testNonMatchingTxnFirstOffsetMetadataNotCached STARTED

kafka.log.ProducerStateManagerTest > testNonMatchingTxnFirstOffsetMetadataNotCached PASSED

kafka.log.ProducerStateManagerTest > testFirstUnstableOffsetAfterEviction STARTED

kafka.log.ProducerStateManagerTest > testFirstUnstableOffsetAfterEviction PASSED

kafka.log.ProducerStateManagerTest > testNoValidationOnFirstEntryWhenLoadingLog STARTED

kafka.log.ProducerStateManagerTest > testNoValidationOnFirstEntryWhenLoadingLog PASSED

kafka.log.ProducerStateManagerTest > testLoadFromEmptySnapshotFile STARTED

kafka.log.ProducerStateManagerTest > testLoadFromEmptySnapshotFile PASSED

kafka.log.ProducerStateManagerTest > testProducersWithOngoingTransactionsDontExpire STARTED

kafka.log.ProducerStateManagerTest > testProducersWithOngoingTransactionsDontExpire PASSED

kafka.log.ProducerStateManagerTest > testBasicIdMapping STARTED

kafka.log.ProducerStateManagerTest > testBasicIdMapping PASSED

kafka.log.ProducerStateManagerTest > updateProducerTransactionState STARTED

kafka.log.ProducerStateManagerTest > updateProducerTransactionState PASSED

kafka.log.ProducerStateManagerTest > testRecoverFromSnapshot STARTED

kafka.log.ProducerStateManagerTest > testRecoverFromSnapshot PASSED

kafka.log.ProducerStateManagerTest > testSequenceNotValidatedForGroupMetadataTopic STARTED

kafka.log.ProducerStateManagerTest > testSequenceNotValidatedForGroupMetadataTopic PASSED

kafka.log.ProducerStateManagerTest > testLoadFromSnapshotRemovesNonRetainedProducers STARTED

kafka.log.ProducerStateManagerTest > testLoadFromSnapshotRemovesNonRetainedProducers PASSED

kafka.log.ProducerStateManagerTest > testFirstUnstableOffset STARTED

kafka.log.ProducerStateManagerTest > testFirstUnstableOffset PASSED

kafka.log.ProducerStateManagerTest > testTxnFirstOffsetMetadataCached STARTED

kafka.log.ProducerStateManagerTest > testTxnFirstOffsetMetadataCached PASSED

kafka.log.ProducerStateManagerTest > testCoordinatorFencedAfterReload STARTED

kafka.log.ProducerStateManagerTest > testCoordinatorFencedAfterReload PASSED

kafka.log.ProducerStateManagerTest > testControlRecordBumpsEpoch STARTED

kafka.log.ProducerStateManagerTest > testControlRecordBumpsEpoch PASSED

kafka.log.ProducerStateManagerTest > testAcceptAppendWithoutProducerStateOnReplica STARTED

kafka.log.ProducerStateManagerTest > testAcceptAppendWithoutProducerStateOnReplica PASSED

kafka.log.ProducerStateManagerTest > testLoadFromCorruptSnapshotFile STARTED

kafka.log.ProducerStateManagerTest > testLoadFromCorruptSnapshotFile PASSED

kafka.log.ProducerStateManagerTest > testProducerSequenceWrapAround STARTED

kafka.log.ProducerStateManagerTest > testProducerSequenceWrapAround PASSED

kafka.log.ProducerStateManagerTest > testPidExpirationTimeout STARTED

kafka.log.ProducerStateManagerTest > testPidExpirationTimeout PASSED

kafka.log.ProducerStateManagerTest > testAcceptAppendWithSequenceGapsOnReplica STARTED

kafka.log.ProducerStateManagerTest > testAcceptAppendWithSequenceGapsOnReplica PASSED

kafka.log.ProducerStateManagerTest > testOldEpochForControlRecord STARTED

kafka.log.ProducerStateManagerTest > testOldEpochForControlRecord PASSED

kafka.log.ProducerStateManagerTest > testTruncateAndReloadRemovesOutOfRangeSnapshots STARTED

kafka.log.ProducerStateManagerTest > testTruncateAndReloadRemovesOutOfRangeSnapshots PASSED

kafka.log.ProducerStateManagerTest > testStartOffset STARTED

kafka.log.ProducerStateManagerTest > testStartOffset PASSED

kafka.log.ProducerStateManagerTest > testProducerSequenceInvalidWrapAround STARTED

kafka.log.ProducerStateManagerTest > testProducerSequenceInvalidWrapAround PASSED

kafka.log.ProducerStateManagerTest > testTruncateHead STARTED

kafka.log.ProducerStateManagerTest > testTruncateHead PASSED

kafka.log.ProducerStateManagerTest > testNonTransactionalAppendWithOngoingTransaction STARTED

kafka.log.ProducerStateManagerTest > testNonTransactionalAppendWithOngoingTransaction PASSED

kafka.log.ProducerStateManagerTest > testSkipSnapshotIfOffsetUnchanged STARTED

kafka.log.ProducerStateManagerTest > testSkipSnapshotIfOffsetUnchanged PASSED

1718 tests completed, 1 failed, 4 skipped
:kafka-trunk-jdk7:core:test FAILED
:test_core_2_11 FAILED

FAILURE: Build failed with an exception.

* What went wrong:
Execution failed for task ':kafka-trunk-jdk7:core:test'.
> There were failing tests. See the report at: file://<https://builds.apache.org/job/kafka-trunk-jdk7/ws/core/build/reports/tests/test/index.html>

* Try:
Run with --stacktrace option to get the stack trace. Run with --info or --debug option to
get more log output.

* Get more help at https://help.gradle.org

BUILD FAILED in 53m 7s
16 actionable tasks: 3 executed, 13 up-to-date
Build step 'Execute shell' marked build as failure
[FINDBUGS] Collecting findbugs analysis files...
Setting GRADLE_3_4_RC_2_HOME=/home/jenkins/jenkins-slave/tools/hudson.plugins.gradle.GradleInstallation/Gradle_3.4-rc-2
[FINDBUGS] Searching for all files in <https://builds.apache.org/job/kafka-trunk-jdk7/ws/>
that match the pattern **/build/reports/findbugs/*.xml
[FINDBUGS] Parsing 1 file in <https://builds.apache.org/job/kafka-trunk-jdk7/ws/>
[FINDBUGS] Successfully parsed file <https://builds.apache.org/job/kafka-trunk-jdk7/ws/core/build/reports/findbugs/main.xml>
with 0 unique warnings and 0 duplicates.
Setting GRADLE_3_4_RC_2_HOME=/home/jenkins/jenkins-slave/tools/hudson.plugins.gradle.GradleInstallation/Gradle_3.4-rc-2
Setting GRADLE_3_4_RC_2_HOME=/home/jenkins/jenkins-slave/tools/hudson.plugins.gradle.GradleInstallation/Gradle_3.4-rc-2
<Git Blamer> Using GitBlamer to create author and commit information for all warnings.
<Git Blamer> GIT_COMMIT=e3c32391f95d82a217295c7e4c1519981124bc3f, workspace=<https://builds.apache.org/job/kafka-trunk-jdk7/ws/>
[FINDBUGS] Computing warning deltas based on reference build #2983
Recording test results
Setting GRADLE_3_4_RC_2_HOME=/home/jenkins/jenkins-slave/tools/hudson.plugins.gradle.GradleInstallation/Gradle_3.4-rc-2
Setting GRADLE_3_4_RC_2_HOME=/home/jenkins/jenkins-slave/tools/hudson.plugins.gradle.GradleInstallation/Gradle_3.4-rc-2
Not sending mail to unregistered user wangguoz@gmail.com

Mime
View raw message