kafka-dev mailing list archives

Site index · List index
Message view « Date » · « Thread »
Top « Date » · « Thread »
From Apache Jenkins Server <jenk...@builds.apache.org>
Subject Build failed in Jenkins: kafka-trunk-jdk7 #2992
Date Wed, 22 Nov 2017 16:07:07 GMT
See <https://builds.apache.org/job/kafka-trunk-jdk7/2992/display/redirect?page=changes>

Changes:

[ismael] KAFKA-1044; Eliminate direct and non-optional log4j references from

------------------------------------------
[...truncated 385.34 KB...]

kafka.network.SocketServerTest > testGracefulClose PASSED

kafka.network.SocketServerTest > controlThrowable STARTED

kafka.network.SocketServerTest > controlThrowable PASSED

kafka.network.SocketServerTest > testRequestMetricsAfterStop STARTED

kafka.network.SocketServerTest > testRequestMetricsAfterStop PASSED

kafka.network.SocketServerTest > testConnectionIdReuse STARTED

kafka.network.SocketServerTest > testConnectionIdReuse PASSED

kafka.network.SocketServerTest > testClientDisconnectionUpdatesRequestMetrics STARTED

kafka.network.SocketServerTest > testClientDisconnectionUpdatesRequestMetrics PASSED

kafka.network.SocketServerTest > testProcessorMetricsTags STARTED

kafka.network.SocketServerTest > testProcessorMetricsTags PASSED

kafka.network.SocketServerTest > testMaxConnectionsPerIp STARTED

kafka.network.SocketServerTest > testMaxConnectionsPerIp PASSED

kafka.network.SocketServerTest > testConnectionId STARTED

kafka.network.SocketServerTest > testConnectionId PASSED

kafka.network.SocketServerTest > testBrokerSendAfterChannelClosedUpdatesRequestMetrics
STARTED

kafka.network.SocketServerTest > testBrokerSendAfterChannelClosedUpdatesRequestMetrics
PASSED

kafka.network.SocketServerTest > simpleRequest STARTED

kafka.network.SocketServerTest > simpleRequest PASSED

kafka.network.SocketServerTest > closingChannelException STARTED

kafka.network.SocketServerTest > closingChannelException PASSED

kafka.network.SocketServerTest > testIdleConnection STARTED

kafka.network.SocketServerTest > testIdleConnection PASSED

kafka.network.SocketServerTest > testMetricCollectionAfterShutdown STARTED

kafka.network.SocketServerTest > testMetricCollectionAfterShutdown PASSED

kafka.network.SocketServerTest > testSessionPrincipal STARTED

kafka.network.SocketServerTest > testSessionPrincipal PASSED

kafka.network.SocketServerTest > configureNewConnectionException STARTED

kafka.network.SocketServerTest > configureNewConnectionException PASSED

kafka.network.SocketServerTest > testMaxConnectionsPerIpOverrides STARTED

kafka.network.SocketServerTest > testMaxConnectionsPerIpOverrides PASSED

kafka.network.SocketServerTest > processNewResponseException STARTED

kafka.network.SocketServerTest > processNewResponseException PASSED

kafka.network.SocketServerTest > processCompletedSendException STARTED

kafka.network.SocketServerTest > processCompletedSendException PASSED

kafka.network.SocketServerTest > processDisconnectedException STARTED

kafka.network.SocketServerTest > processDisconnectedException PASSED

kafka.network.SocketServerTest > sendCancelledKeyException STARTED

kafka.network.SocketServerTest > sendCancelledKeyException PASSED

kafka.network.SocketServerTest > processCompletedReceiveException STARTED

kafka.network.SocketServerTest > processCompletedReceiveException PASSED

kafka.network.SocketServerTest > testSocketsCloseOnShutdown STARTED

kafka.network.SocketServerTest > testSocketsCloseOnShutdown PASSED

kafka.network.SocketServerTest > pollException STARTED

kafka.network.SocketServerTest > pollException PASSED

kafka.network.SocketServerTest > testSslSocketServer STARTED

kafka.network.SocketServerTest > testSslSocketServer PASSED

kafka.network.SocketServerTest > tooBigRequestIsRejected STARTED

kafka.network.SocketServerTest > tooBigRequestIsRejected PASSED

kafka.integration.PrimitiveApiTest > testMultiProduce STARTED

kafka.integration.PrimitiveApiTest > testMultiProduce PASSED

kafka.integration.PrimitiveApiTest > testDefaultEncoderProducerAndFetch STARTED

kafka.integration.PrimitiveApiTest > testDefaultEncoderProducerAndFetch PASSED

kafka.integration.PrimitiveApiTest > testFetchRequestCanProperlySerialize STARTED

kafka.integration.PrimitiveApiTest > testFetchRequestCanProperlySerialize PASSED

kafka.integration.PrimitiveApiTest > testPipelinedProduceRequests STARTED

kafka.integration.PrimitiveApiTest > testPipelinedProduceRequests PASSED

kafka.integration.PrimitiveApiTest > testProduceAndMultiFetch STARTED

kafka.integration.PrimitiveApiTest > testProduceAndMultiFetch PASSED

kafka.integration.PrimitiveApiTest > testDefaultEncoderProducerAndFetchWithCompression
STARTED

kafka.integration.PrimitiveApiTest > testDefaultEncoderProducerAndFetchWithCompression
PASSED

kafka.integration.PrimitiveApiTest > testConsumerEmptyTopic STARTED

kafka.integration.PrimitiveApiTest > testConsumerEmptyTopic PASSED

kafka.integration.PrimitiveApiTest > testEmptyFetchRequest STARTED

kafka.integration.PrimitiveApiTest > testEmptyFetchRequest PASSED

kafka.integration.MetricsDuringTopicCreationDeletionTest > testMetricsDuringTopicCreateDelete
STARTED

kafka.integration.MetricsDuringTopicCreationDeletionTest > testMetricsDuringTopicCreateDelete
PASSED

kafka.integration.UncleanLeaderElectionTest > testUncleanLeaderElectionEnabled STARTED

kafka.integration.UncleanLeaderElectionTest > testUncleanLeaderElectionEnabled PASSED

kafka.integration.UncleanLeaderElectionTest > testCleanLeaderElectionDisabledByTopicOverride
STARTED

kafka.integration.UncleanLeaderElectionTest > testCleanLeaderElectionDisabledByTopicOverride
SKIPPED

kafka.integration.UncleanLeaderElectionTest > testUncleanLeaderElectionDisabled STARTED

kafka.integration.UncleanLeaderElectionTest > testUncleanLeaderElectionDisabled SKIPPED

kafka.integration.UncleanLeaderElectionTest > testUncleanLeaderElectionInvalidTopicOverride
STARTED

kafka.integration.UncleanLeaderElectionTest > testUncleanLeaderElectionInvalidTopicOverride
PASSED

kafka.integration.UncleanLeaderElectionTest > testUncleanLeaderElectionEnabledByTopicOverride
STARTED

kafka.integration.UncleanLeaderElectionTest > testUncleanLeaderElectionEnabledByTopicOverride
PASSED

kafka.integration.MinIsrConfigTest > testDefaultKafkaConfig STARTED

kafka.integration.MinIsrConfigTest > testDefaultKafkaConfig PASSED

kafka.integration.TopicMetadataTest > testIsrAfterBrokerShutDownAndJoinsBack STARTED

kafka.integration.TopicMetadataTest > testIsrAfterBrokerShutDownAndJoinsBack PASSED

kafka.integration.TopicMetadataTest > testAutoCreateTopicWithCollision STARTED

kafka.integration.TopicMetadataTest > testAutoCreateTopicWithCollision PASSED

kafka.integration.TopicMetadataTest > testAliveBrokerListWithNoTopics STARTED

kafka.integration.TopicMetadataTest > testAliveBrokerListWithNoTopics PASSED

kafka.integration.TopicMetadataTest > testAutoCreateTopic STARTED

kafka.integration.TopicMetadataTest > testAutoCreateTopic PASSED

kafka.integration.TopicMetadataTest > testGetAllTopicMetadata STARTED

kafka.integration.TopicMetadataTest > testGetAllTopicMetadata PASSED

kafka.integration.TopicMetadataTest > testAliveBrokersListWithNoTopicsAfterNewBrokerStartup
STARTED

kafka.integration.TopicMetadataTest > testAliveBrokersListWithNoTopicsAfterNewBrokerStartup
PASSED

kafka.integration.TopicMetadataTest > testBasicTopicMetadata STARTED

kafka.integration.TopicMetadataTest > testBasicTopicMetadata PASSED

kafka.integration.TopicMetadataTest > testAutoCreateTopicWithInvalidReplication STARTED

kafka.integration.TopicMetadataTest > testAutoCreateTopicWithInvalidReplication PASSED

kafka.integration.TopicMetadataTest > testAliveBrokersListWithNoTopicsAfterABrokerShutdown
STARTED

kafka.integration.TopicMetadataTest > testAliveBrokersListWithNoTopicsAfterABrokerShutdown
PASSED

kafka.integration.AutoOffsetResetTest > testResetToLatestWhenOffsetTooLow STARTED

kafka.integration.AutoOffsetResetTest > testResetToLatestWhenOffsetTooLow PASSED

kafka.integration.AutoOffsetResetTest > testResetToEarliestWhenOffsetTooLow STARTED

kafka.integration.AutoOffsetResetTest > testResetToEarliestWhenOffsetTooLow PASSED

kafka.integration.AutoOffsetResetTest > testResetToEarliestWhenOffsetTooHigh STARTED

kafka.integration.AutoOffsetResetTest > testResetToEarliestWhenOffsetTooHigh PASSED

kafka.integration.AutoOffsetResetTest > testResetToLatestWhenOffsetTooHigh STARTED

kafka.integration.AutoOffsetResetTest > testResetToLatestWhenOffsetTooHigh PASSED

kafka.integration.FetcherTest > testFetcher STARTED

kafka.integration.FetcherTest > testFetcher PASSED

1719 tests completed, 1 failed, 4 skipped
:kafka-trunk-jdk7:core:test FAILED
:test_core_2_11 FAILED

FAILURE: Build failed with an exception.

* What went wrong:
Execution failed for task ':kafka-trunk-jdk7:core:test'.
> There were failing tests. See the report at: file://<https://builds.apache.org/job/kafka-trunk-jdk7/ws/core/build/reports/tests/test/index.html>

* Try:
Run with --stacktrace option to get the stack trace. Run with --info or --debug option to
get more log output.

* Get more help at https://help.gradle.org

BUILD FAILED in 53m 24s
16 actionable tasks: 13 executed, 3 up-to-date
Build step 'Execute shell' marked build as failure
[FINDBUGS] Collecting findbugs analysis files...
Setting GRADLE_3_4_RC_2_HOME=/home/jenkins/jenkins-slave/tools/hudson.plugins.gradle.GradleInstallation/Gradle_3.4-rc-2
[FINDBUGS] Searching for all files in <https://builds.apache.org/job/kafka-trunk-jdk7/ws/>
that match the pattern **/build/reports/findbugs/*.xml
[FINDBUGS] Parsing 1 file in <https://builds.apache.org/job/kafka-trunk-jdk7/ws/>
[FINDBUGS] Successfully parsed file <https://builds.apache.org/job/kafka-trunk-jdk7/ws/core/build/reports/findbugs/main.xml>
with 0 unique warnings and 0 duplicates.
Setting GRADLE_3_4_RC_2_HOME=/home/jenkins/jenkins-slave/tools/hudson.plugins.gradle.GradleInstallation/Gradle_3.4-rc-2
Setting GRADLE_3_4_RC_2_HOME=/home/jenkins/jenkins-slave/tools/hudson.plugins.gradle.GradleInstallation/Gradle_3.4-rc-2
<Git Blamer> Using GitBlamer to create author and commit information for all warnings.
<Git Blamer> GIT_COMMIT=ed8b0315a6c3705b2a163ce3ab4723234779264f, workspace=<https://builds.apache.org/job/kafka-trunk-jdk7/ws/>
[FINDBUGS] Computing warning deltas based on reference build #2986
Recording test results
Setting GRADLE_3_4_RC_2_HOME=/home/jenkins/jenkins-slave/tools/hudson.plugins.gradle.GradleInstallation/Gradle_3.4-rc-2
Setting GRADLE_3_4_RC_2_HOME=/home/jenkins/jenkins-slave/tools/hudson.plugins.gradle.GradleInstallation/Gradle_3.4-rc-2
Not sending mail to unregistered user wangguoz@gmail.com
Not sending mail to unregistered user ismael@juma.me.uk
Not sending mail to unregistered user damian.guy@gmail.com

Mime
View raw message