kafka-dev mailing list archives

Site index · List index
Message view « Date » · « Thread »
Top « Date » · « Thread »
From Apache Jenkins Server <jenk...@builds.apache.org>
Subject Build failed in Jenkins: kafka-trunk-jdk7 #2982
Date Sun, 19 Nov 2017 00:11:46 GMT
See <https://builds.apache.org/job/kafka-trunk-jdk7/2982/display/redirect?page=changes>

Changes:

[wangguoz] KAFKA-6122: Global Consumer should handle TimeoutException

------------------------------------------
[...truncated 385.74 KB...]
kafka.security.auth.SimpleAclAuthorizerTest > testDistributedConcurrentModificationOfResourceAcls
STARTED

kafka.security.auth.SimpleAclAuthorizerTest > testDistributedConcurrentModificationOfResourceAcls
PASSED

kafka.security.auth.SimpleAclAuthorizerTest > testAclManagementAPIs STARTED

kafka.security.auth.SimpleAclAuthorizerTest > testAclManagementAPIs PASSED

kafka.security.auth.SimpleAclAuthorizerTest > testWildCardAcls STARTED

kafka.security.auth.SimpleAclAuthorizerTest > testWildCardAcls PASSED

kafka.security.auth.SimpleAclAuthorizerTest > testTopicAcl STARTED

kafka.security.auth.SimpleAclAuthorizerTest > testTopicAcl PASSED

kafka.security.auth.SimpleAclAuthorizerTest > testSuperUserHasAccess STARTED

kafka.security.auth.SimpleAclAuthorizerTest > testSuperUserHasAccess PASSED

kafka.security.auth.SimpleAclAuthorizerTest > testDenyTakesPrecedence STARTED

kafka.security.auth.SimpleAclAuthorizerTest > testDenyTakesPrecedence PASSED

kafka.security.auth.SimpleAclAuthorizerTest > testNoAclFoundOverride STARTED

kafka.security.auth.SimpleAclAuthorizerTest > testNoAclFoundOverride PASSED

kafka.security.auth.SimpleAclAuthorizerTest > testHighConcurrencyModificationOfResourceAcls
STARTED

kafka.security.auth.SimpleAclAuthorizerTest > testHighConcurrencyModificationOfResourceAcls
PASSED

kafka.security.auth.SimpleAclAuthorizerTest > testLoadCache STARTED

kafka.security.auth.SimpleAclAuthorizerTest > testLoadCache PASSED

kafka.security.auth.OperationTest > testJavaConversions STARTED

kafka.security.auth.OperationTest > testJavaConversions PASSED

kafka.security.auth.ZkAuthorizationTest > testIsZkSecurityEnabled STARTED

kafka.security.auth.ZkAuthorizationTest > testIsZkSecurityEnabled PASSED

kafka.security.auth.ZkAuthorizationTest > testZkUtils STARTED

kafka.security.auth.ZkAuthorizationTest > testZkUtils PASSED

kafka.security.auth.ZkAuthorizationTest > testZkAntiMigration STARTED

kafka.security.auth.ZkAuthorizationTest > testZkAntiMigration PASSED

kafka.security.auth.ZkAuthorizationTest > testZkMigration STARTED

kafka.security.auth.ZkAuthorizationTest > testZkMigration PASSED

kafka.security.auth.ZkAuthorizationTest > testChroot STARTED

kafka.security.auth.ZkAuthorizationTest > testChroot PASSED

kafka.security.auth.ZkAuthorizationTest > testDelete STARTED

kafka.security.auth.ZkAuthorizationTest > testDelete PASSED

kafka.security.auth.ZkAuthorizationTest > testDeleteRecursive STARTED

kafka.security.auth.ZkAuthorizationTest > testDeleteRecursive PASSED

kafka.security.auth.AclTest > testAclJsonConversion STARTED

kafka.security.auth.AclTest > testAclJsonConversion PASSED

kafka.security.auth.ResourceTypeTest > testJavaConversions STARTED

kafka.security.auth.ResourceTypeTest > testJavaConversions PASSED

kafka.security.auth.ResourceTypeTest > testFromString STARTED

kafka.security.auth.ResourceTypeTest > testFromString PASSED

kafka.security.auth.PermissionTypeTest > testJavaConversions STARTED

kafka.security.auth.PermissionTypeTest > testJavaConversions PASSED

kafka.security.auth.PermissionTypeTest > testFromString STARTED

kafka.security.auth.PermissionTypeTest > testFromString PASSED

kafka.KafkaTest > testGetKafkaConfigFromArgsWrongSetValue STARTED

kafka.KafkaTest > testGetKafkaConfigFromArgsWrongSetValue PASSED

kafka.KafkaTest > testKafkaSslPasswords STARTED

kafka.KafkaTest > testKafkaSslPasswords PASSED

kafka.KafkaTest > testGetKafkaConfigFromArgs STARTED

kafka.KafkaTest > testGetKafkaConfigFromArgs PASSED

kafka.KafkaTest > testGetKafkaConfigFromArgsNonArgsAtTheEnd STARTED

kafka.KafkaTest > testGetKafkaConfigFromArgsNonArgsAtTheEnd PASSED

kafka.KafkaTest > testGetKafkaConfigFromArgsNonArgsOnly STARTED

kafka.KafkaTest > testGetKafkaConfigFromArgsNonArgsOnly PASSED

kafka.KafkaTest > testGetKafkaConfigFromArgsNonArgsAtTheBegging STARTED

kafka.KafkaTest > testGetKafkaConfigFromArgsNonArgsAtTheBegging PASSED

kafka.producer.SyncProducerTest > testReachableServer STARTED

kafka.producer.SyncProducerTest > testReachableServer PASSED

kafka.producer.SyncProducerTest > testMessageSizeTooLarge STARTED

kafka.producer.SyncProducerTest > testMessageSizeTooLarge PASSED

kafka.producer.SyncProducerTest > testNotEnoughReplicas STARTED

kafka.producer.SyncProducerTest > testNotEnoughReplicas PASSED

kafka.producer.SyncProducerTest > testMessageSizeTooLargeWithAckZero STARTED

kafka.producer.SyncProducerTest > testMessageSizeTooLargeWithAckZero PASSED

kafka.producer.SyncProducerTest > testProducerCanTimeout STARTED

kafka.producer.SyncProducerTest > testProducerCanTimeout PASSED

kafka.producer.SyncProducerTest > testProduceRequestWithNoResponse STARTED

kafka.producer.SyncProducerTest > testProduceRequestWithNoResponse PASSED

kafka.producer.SyncProducerTest > testEmptyProduceRequest STARTED

kafka.producer.SyncProducerTest > testEmptyProduceRequest PASSED

kafka.producer.SyncProducerTest > testProduceCorrectlyReceivesResponse STARTED

kafka.producer.SyncProducerTest > testProduceCorrectlyReceivesResponse PASSED

kafka.producer.ProducerTest > testSendToNewTopic STARTED

kafka.producer.ProducerTest > testSendToNewTopic PASSED

kafka.producer.ProducerTest > testAsyncSendCanCorrectlyFailWithTimeout STARTED

kafka.producer.ProducerTest > testAsyncSendCanCorrectlyFailWithTimeout PASSED

kafka.producer.ProducerTest > testSendNullMessage STARTED

kafka.producer.ProducerTest > testSendNullMessage PASSED

kafka.producer.ProducerTest > testUpdateBrokerPartitionInfo STARTED

kafka.producer.ProducerTest > testUpdateBrokerPartitionInfo PASSED

kafka.producer.ProducerTest > testSendWithDeadBroker STARTED

kafka.producer.ProducerTest > testSendWithDeadBroker PASSED

kafka.producer.AsyncProducerTest > testFailedSendRetryLogic STARTED

kafka.producer.AsyncProducerTest > testFailedSendRetryLogic PASSED

kafka.producer.AsyncProducerTest > testQueueTimeExpired STARTED

kafka.producer.AsyncProducerTest > testQueueTimeExpired PASSED

kafka.producer.AsyncProducerTest > testPartitionAndCollateEvents STARTED

kafka.producer.AsyncProducerTest > testPartitionAndCollateEvents PASSED

kafka.producer.AsyncProducerTest > testBatchSize STARTED

kafka.producer.AsyncProducerTest > testBatchSize PASSED

kafka.producer.AsyncProducerTest > testSerializeEvents STARTED

kafka.producer.AsyncProducerTest > testSerializeEvents PASSED

kafka.producer.AsyncProducerTest > testProducerQueueSize STARTED

kafka.producer.AsyncProducerTest > testProducerQueueSize PASSED

kafka.producer.AsyncProducerTest > testRandomPartitioner STARTED

kafka.producer.AsyncProducerTest > testRandomPartitioner PASSED

kafka.producer.AsyncProducerTest > testInvalidConfiguration STARTED

kafka.producer.AsyncProducerTest > testInvalidConfiguration PASSED

kafka.producer.AsyncProducerTest > testInvalidPartition STARTED

kafka.producer.AsyncProducerTest > testInvalidPartition PASSED

kafka.producer.AsyncProducerTest > testNoBroker STARTED

kafka.producer.AsyncProducerTest > testNoBroker PASSED

kafka.producer.AsyncProducerTest > testProduceAfterClosed STARTED

kafka.producer.AsyncProducerTest > testProduceAfterClosed PASSED

kafka.producer.AsyncProducerTest > testJavaProducer STARTED

kafka.producer.AsyncProducerTest > testJavaProducer PASSED

kafka.producer.AsyncProducerTest > testIncompatibleEncoder STARTED

kafka.producer.AsyncProducerTest > testIncompatibleEncoder PASSED

1718 tests completed, 1 failed, 4 skipped
:kafka-trunk-jdk7:core:test FAILED
:test_core_2_11 FAILED

FAILURE: Build failed with an exception.

* What went wrong:
Execution failed for task ':kafka-trunk-jdk7:core:test'.
> There were failing tests. See the report at: file://<https://builds.apache.org/job/kafka-trunk-jdk7/ws/core/build/reports/tests/test/index.html>

* Try:
Run with --stacktrace option to get the stack trace. Run with --info or --debug option to
get more log output.

* Get more help at https://help.gradle.org

BUILD FAILED in 1h 16m 30s
16 actionable tasks: 13 executed, 3 up-to-date
Build step 'Execute shell' marked build as failure
[FINDBUGS] Collecting findbugs analysis files...
Setting GRADLE_3_4_RC_2_HOME=/home/jenkins/jenkins-slave/tools/hudson.plugins.gradle.GradleInstallation/Gradle_3.4-rc-2
[FINDBUGS] Searching for all files in <https://builds.apache.org/job/kafka-trunk-jdk7/ws/>
that match the pattern **/build/reports/findbugs/*.xml
[FINDBUGS] Parsing 1 file in <https://builds.apache.org/job/kafka-trunk-jdk7/ws/>
[FINDBUGS] Successfully parsed file <https://builds.apache.org/job/kafka-trunk-jdk7/ws/core/build/reports/findbugs/main.xml>
with 0 unique warnings and 0 duplicates.
Setting GRADLE_3_4_RC_2_HOME=/home/jenkins/jenkins-slave/tools/hudson.plugins.gradle.GradleInstallation/Gradle_3.4-rc-2
Setting GRADLE_3_4_RC_2_HOME=/home/jenkins/jenkins-slave/tools/hudson.plugins.gradle.GradleInstallation/Gradle_3.4-rc-2
<Git Blamer> Using GitBlamer to create author and commit information for all warnings.
<Git Blamer> GIT_COMMIT=40fd9fa98105111bca373e76f8f39914cade709b, workspace=<https://builds.apache.org/job/kafka-trunk-jdk7/ws/>
[FINDBUGS] Computing warning deltas based on reference build #2978
Recording test results
Setting GRADLE_3_4_RC_2_HOME=/home/jenkins/jenkins-slave/tools/hudson.plugins.gradle.GradleInstallation/Gradle_3.4-rc-2
Setting GRADLE_3_4_RC_2_HOME=/home/jenkins/jenkins-slave/tools/hudson.plugins.gradle.GradleInstallation/Gradle_3.4-rc-2
Not sending mail to unregistered user wangguoz@gmail.com
Not sending mail to unregistered user ismael@juma.me.uk

Mime
View raw message