kafka-dev mailing list archives

Site index · List index
Message view « Date » · « Thread »
Top « Date » · « Thread »
From Apache Jenkins Server <jenk...@builds.apache.org>
Subject Build failed in Jenkins: kafka-trunk-jdk8 #2210
Date Wed, 15 Nov 2017 15:36:16 GMT
See <https://builds.apache.org/job/kafka-trunk-jdk8/2210/display/redirect?page=changes>

Changes:

[ismael] MINOR: Use match instead of if/else in KafkaZkClient

------------------------------------------
[...truncated 1.79 MB...]
org.apache.kafka.streams.integration.RegexSourceIntegrationTest > testShouldReadFromRegexAndNamedTopics
PASSED

org.apache.kafka.streams.integration.RegexSourceIntegrationTest > testRegexMatchesTopicsAWhenCreated
STARTED

org.apache.kafka.streams.integration.RegexSourceIntegrationTest > testRegexMatchesTopicsAWhenCreated
PASSED

org.apache.kafka.streams.integration.RegexSourceIntegrationTest > testMultipleConsumersCanReadFromPartitionedTopic
STARTED

org.apache.kafka.streams.integration.RegexSourceIntegrationTest > testMultipleConsumersCanReadFromPartitionedTopic
PASSED

org.apache.kafka.streams.integration.RegexSourceIntegrationTest > testRegexMatchesTopicsAWhenDeleted
STARTED

org.apache.kafka.streams.integration.RegexSourceIntegrationTest > testRegexMatchesTopicsAWhenDeleted
PASSED

org.apache.kafka.streams.integration.RegexSourceIntegrationTest > testNoMessagesSentExceptionFromOverlappingPatterns
STARTED

org.apache.kafka.streams.integration.RegexSourceIntegrationTest > testNoMessagesSentExceptionFromOverlappingPatterns
PASSED

org.apache.kafka.streams.integration.RegexSourceIntegrationTest > shouldAddStateStoreToRegexDefinedSource
STARTED

org.apache.kafka.streams.integration.RegexSourceIntegrationTest > shouldAddStateStoreToRegexDefinedSource
PASSED

org.apache.kafka.streams.integration.KStreamRepartitionJoinTest > shouldCorrectlyRepartitionOnJoinOperationsWithZeroSizedCache
STARTED

org.apache.kafka.streams.integration.KStreamRepartitionJoinTest > shouldCorrectlyRepartitionOnJoinOperationsWithZeroSizedCache
PASSED

org.apache.kafka.streams.integration.KStreamRepartitionJoinTest > shouldCorrectlyRepartitionOnJoinOperationsWithNonZeroSizedCache
STARTED

org.apache.kafka.streams.integration.KStreamRepartitionJoinTest > shouldCorrectlyRepartitionOnJoinOperationsWithNonZeroSizedCache
PASSED

org.apache.kafka.streams.integration.InternalTopicIntegrationTest > shouldCompactTopicsForStateChangelogs
STARTED

org.apache.kafka.streams.integration.InternalTopicIntegrationTest > shouldCompactTopicsForStateChangelogs
PASSED

org.apache.kafka.streams.integration.InternalTopicIntegrationTest > shouldUseCompactAndDeleteForWindowStoreChangelogs
STARTED

org.apache.kafka.streams.integration.InternalTopicIntegrationTest > shouldUseCompactAndDeleteForWindowStoreChangelogs
PASSED

org.apache.kafka.streams.integration.KStreamAggregationIntegrationTest > shouldReduceSessionWindows
STARTED

org.apache.kafka.streams.integration.KStreamAggregationIntegrationTest > shouldReduceSessionWindows
PASSED

org.apache.kafka.streams.integration.KStreamAggregationIntegrationTest > shouldReduce STARTED

org.apache.kafka.streams.integration.KStreamAggregationIntegrationTest > shouldReduce PASSED

org.apache.kafka.streams.integration.KStreamAggregationIntegrationTest > shouldAggregate
STARTED

org.apache.kafka.streams.integration.KStreamAggregationIntegrationTest > shouldAggregate
PASSED

org.apache.kafka.streams.integration.KStreamAggregationIntegrationTest > shouldCount STARTED

org.apache.kafka.streams.integration.KStreamAggregationIntegrationTest > shouldCount PASSED

org.apache.kafka.streams.integration.KStreamAggregationIntegrationTest > shouldGroupByKey
STARTED

org.apache.kafka.streams.integration.KStreamAggregationIntegrationTest > shouldGroupByKey
PASSED

org.apache.kafka.streams.integration.KStreamAggregationIntegrationTest > shouldCountWithInternalStore
STARTED

org.apache.kafka.streams.integration.KStreamAggregationIntegrationTest > shouldCountWithInternalStore
PASSED

org.apache.kafka.streams.integration.KStreamAggregationIntegrationTest > shouldReduceWindowed
STARTED

org.apache.kafka.streams.integration.KStreamAggregationIntegrationTest > shouldReduceWindowed
PASSED

org.apache.kafka.streams.integration.KStreamAggregationIntegrationTest > shouldCountSessionWindows
STARTED

org.apache.kafka.streams.integration.KStreamAggregationIntegrationTest > shouldCountSessionWindows
PASSED

org.apache.kafka.streams.integration.KStreamAggregationIntegrationTest > shouldAggregateWindowed
STARTED

org.apache.kafka.streams.integration.KStreamAggregationIntegrationTest > shouldAggregateWindowed
PASSED

org.apache.kafka.streams.integration.GlobalKTableIntegrationTest > shouldKStreamGlobalKTableLeftJoin
STARTED

org.apache.kafka.streams.integration.GlobalKTableIntegrationTest > shouldKStreamGlobalKTableLeftJoin
PASSED

org.apache.kafka.streams.integration.GlobalKTableIntegrationTest > shouldRestoreTransactionalMessages
STARTED

org.apache.kafka.streams.integration.GlobalKTableIntegrationTest > shouldRestoreTransactionalMessages
PASSED

org.apache.kafka.streams.integration.GlobalKTableIntegrationTest > shouldKStreamGlobalKTableJoin
STARTED

org.apache.kafka.streams.integration.GlobalKTableIntegrationTest > shouldKStreamGlobalKTableJoin
PASSED

org.apache.kafka.streams.integration.ResetIntegrationTest > testReprocessingFromScratchAfterResetWithIntermediateUserTopic
STARTED

org.apache.kafka.streams.integration.ResetIntegrationTest > testReprocessingFromScratchAfterResetWithIntermediateUserTopic
PASSED

org.apache.kafka.streams.integration.ResetIntegrationTest > testReprocessingFromScratchAfterResetWithoutIntermediateUserTopic
STARTED

org.apache.kafka.streams.integration.ResetIntegrationTest > testReprocessingFromScratchAfterResetWithoutIntermediateUserTopic
PASSED

org.apache.kafka.streams.integration.KTableKTableJoinIntegrationTest > shouldLeftOuterJoinQueryable
STARTED

org.apache.kafka.streams.integration.KTableKTableJoinIntegrationTest > shouldLeftOuterJoinQueryable
PASSED

org.apache.kafka.streams.integration.KTableKTableJoinIntegrationTest > shouldInnerLeftJoin
STARTED

org.apache.kafka.streams.integration.KTableKTableJoinIntegrationTest > shouldInnerLeftJoin
PASSED

org.apache.kafka.streams.integration.KTableKTableJoinIntegrationTest > shouldOuterOuterJoin
STARTED

org.apache.kafka.streams.integration.KTableKTableJoinIntegrationTest > shouldOuterOuterJoin
PASSED

org.apache.kafka.streams.integration.KTableKTableJoinIntegrationTest > shouldInnerOuterJoin
STARTED

org.apache.kafka.streams.integration.KTableKTableJoinIntegrationTest > shouldInnerOuterJoin
PASSED

org.apache.kafka.streams.integration.KTableKTableJoinIntegrationTest > shouldLeftInnerJoin
STARTED

org.apache.kafka.streams.integration.KTableKTableJoinIntegrationTest > shouldLeftInnerJoin
PASSED

org.apache.kafka.streams.integration.KTableKTableJoinIntegrationTest > shouldInnerInnerJoinQueryable
STARTED

org.apache.kafka.streams.integration.KTableKTableJoinIntegrationTest > shouldInnerInnerJoinQueryable
PASSED

org.apache.kafka.streams.integration.KTableKTableJoinIntegrationTest > shouldInnerOuterJoinQueryable
STARTED

org.apache.kafka.streams.integration.KTableKTableJoinIntegrationTest > shouldInnerOuterJoinQueryable
PASSED

org.apache.kafka.streams.integration.KTableKTableJoinIntegrationTest > shouldOuterLeftJoin
STARTED

org.apache.kafka.streams.integration.KTableKTableJoinIntegrationTest > shouldOuterLeftJoin
PASSED

org.apache.kafka.streams.integration.KTableKTableJoinIntegrationTest > shouldOuterInnerJoin
STARTED

org.apache.kafka.streams.integration.KTableKTableJoinIntegrationTest > shouldOuterInnerJoin
PASSED

org.apache.kafka.streams.integration.KTableKTableJoinIntegrationTest > shouldInnerInnerJoin
STARTED

org.apache.kafka.streams.integration.KTableKTableJoinIntegrationTest > shouldInnerInnerJoin
PASSED

org.apache.kafka.streams.integration.KTableKTableJoinIntegrationTest > shouldLeftOuterJoin
STARTED

org.apache.kafka.streams.integration.KTableKTableJoinIntegrationTest > shouldLeftOuterJoin
PASSED

org.apache.kafka.streams.integration.KTableKTableJoinIntegrationTest > shouldOuterLeftJoinQueryable
STARTED

org.apache.kafka.streams.integration.KTableKTableJoinIntegrationTest > shouldOuterLeftJoinQueryable
PASSED

org.apache.kafka.streams.integration.KTableKTableJoinIntegrationTest > shouldLeftLeftJoin
STARTED

org.apache.kafka.streams.integration.KTableKTableJoinIntegrationTest > shouldLeftLeftJoin
PASSED

org.apache.kafka.streams.integration.KTableKTableJoinIntegrationTest > shouldOuterInnerJoinQueryable
STARTED

org.apache.kafka.streams.integration.KTableKTableJoinIntegrationTest > shouldOuterInnerJoinQueryable
PASSED

org.apache.kafka.streams.integration.KTableKTableJoinIntegrationTest > shouldLeftInnerJoinQueryable
STARTED

org.apache.kafka.streams.integration.KTableKTableJoinIntegrationTest > shouldLeftInnerJoinQueryable
PASSED

org.apache.kafka.streams.integration.KTableKTableJoinIntegrationTest > shouldInnerLeftJoinQueryable
STARTED

org.apache.kafka.streams.integration.KTableKTableJoinIntegrationTest > shouldInnerLeftJoinQueryable
PASSED

org.apache.kafka.streams.integration.KTableKTableJoinIntegrationTest > shouldLeftLeftJoinQueryable
STARTED

org.apache.kafka.streams.integration.KTableKTableJoinIntegrationTest > shouldLeftLeftJoinQueryable
PASSED

org.apache.kafka.streams.integration.KTableKTableJoinIntegrationTest > shouldOuterOuterJoinQueryable
STARTED

org.apache.kafka.streams.integration.KTableKTableJoinIntegrationTest > shouldOuterOuterJoinQueryable
PASSED

org.apache.kafka.streams.integration.ResetIntegrationWithSslTest > testReprocessingFromScratchAfterResetWithoutIntermediateUserTopic
STARTED

org.apache.kafka.streams.integration.ResetIntegrationWithSslTest > testReprocessingFromScratchAfterResetWithoutIntermediateUserTopic
PASSED

org.apache.kafka.streams.integration.KStreamAggregationDedupIntegrationTest > shouldReduce
STARTED

org.apache.kafka.streams.integration.KStreamAggregationDedupIntegrationTest > shouldReduce
PASSED

org.apache.kafka.streams.integration.KStreamAggregationDedupIntegrationTest > shouldGroupByKey
STARTED

org.apache.kafka.streams.integration.KStreamAggregationDedupIntegrationTest > shouldGroupByKey
PASSED

org.apache.kafka.streams.integration.KStreamAggregationDedupIntegrationTest > shouldReduceWindowed
STARTED

org.apache.kafka.streams.integration.KStreamAggregationDedupIntegrationTest > shouldReduceWindowed
PASSED

org.apache.kafka.streams.integration.JoinIntegrationTest > testInnerKTableKTable STARTED

org.apache.kafka.streams.integration.JoinIntegrationTest > testInnerKTableKTable PASSED

org.apache.kafka.streams.integration.JoinIntegrationTest > testLeftKTableKTable STARTED

org.apache.kafka.streams.integration.JoinIntegrationTest > testLeftKTableKTable PASSED

org.apache.kafka.streams.integration.JoinIntegrationTest > testLeftKStreamKStream STARTED

org.apache.kafka.streams.integration.JoinIntegrationTest > testLeftKStreamKStream PASSED

org.apache.kafka.streams.integration.JoinIntegrationTest > testLeftKStreamKTable STARTED

org.apache.kafka.streams.integration.JoinIntegrationTest > testLeftKStreamKTable PASSED

org.apache.kafka.streams.integration.JoinIntegrationTest > testOuterKTableKTable STARTED

org.apache.kafka.streams.integration.JoinIntegrationTest > testOuterKTableKTable PASSED

org.apache.kafka.streams.integration.JoinIntegrationTest > testInnerKStreamKStream STARTED

org.apache.kafka.streams.integration.JoinIntegrationTest > testInnerKStreamKStream PASSED

org.apache.kafka.streams.integration.JoinIntegrationTest > testOuterKStreamKStream STARTED

org.apache.kafka.streams.integration.JoinIntegrationTest > testOuterKStreamKStream PASSED

org.apache.kafka.streams.integration.JoinIntegrationTest > testInnerKStreamKTable STARTED

org.apache.kafka.streams.integration.JoinIntegrationTest > testInnerKStreamKTable PASSED

1765 tests completed, 2 failed
:streams:test FAILED

FAILURE: Build failed with an exception.

* What went wrong:
Execution failed for task ':streams:test'.
> There were failing tests. See the report at: file://<https://builds.apache.org/job/kafka-trunk-jdk8/ws/streams/build/reports/tests/test/index.html>

* Try:
Run with --stacktrace option to get the stack trace. Run with --info or --debug option to
get more log output.

* Get more help at https://help.gradle.org

BUILD FAILED in 1h 11m 59s
52 actionable tasks: 38 executed, 14 up-to-date
Build step 'Execute shell' marked build as failure
[FINDBUGS] Collecting findbugs analysis files...
Setting GRADLE_3_4_RC_2_HOME=/home/jenkins/jenkins-slave/tools/hudson.plugins.gradle.GradleInstallation/Gradle_3.4-rc-2
[FINDBUGS] Searching for all files in <https://builds.apache.org/job/kafka-trunk-jdk8/ws/>
that match the pattern **/build/reports/findbugs/*.xml
[FINDBUGS] Parsing 5 files in <https://builds.apache.org/job/kafka-trunk-jdk8/ws/>
[FINDBUGS] Successfully parsed file <https://builds.apache.org/job/kafka-trunk-jdk8/ws/clients/build/reports/findbugs/main.xml>
with 0 unique warnings and 0 duplicates.
[FINDBUGS] Successfully parsed file <https://builds.apache.org/job/kafka-trunk-jdk8/ws/core/build/reports/findbugs/main.xml>
with 0 unique warnings and 0 duplicates.
[FINDBUGS] Successfully parsed file <https://builds.apache.org/job/kafka-trunk-jdk8/ws/examples/build/reports/findbugs/main.xml>
with 0 unique warnings and 0 duplicates.
[FINDBUGS] Successfully parsed file <https://builds.apache.org/job/kafka-trunk-jdk8/ws/log4j-appender/build/reports/findbugs/main.xml>
with 0 unique warnings and 0 duplicates.
[FINDBUGS] Successfully parsed file <https://builds.apache.org/job/kafka-trunk-jdk8/ws/streams/build/reports/findbugs/main.xml>
with 0 unique warnings and 0 duplicates.
Setting GRADLE_3_4_RC_2_HOME=/home/jenkins/jenkins-slave/tools/hudson.plugins.gradle.GradleInstallation/Gradle_3.4-rc-2
Setting GRADLE_3_4_RC_2_HOME=/home/jenkins/jenkins-slave/tools/hudson.plugins.gradle.GradleInstallation/Gradle_3.4-rc-2
<Git Blamer> Using GitBlamer to create author and commit information for all warnings.
<Git Blamer> GIT_COMMIT=f300480f882e8b17999e1172bfbec0f13c71eda7, workspace=<https://builds.apache.org/job/kafka-trunk-jdk8/ws/>
[FINDBUGS] Computing warning deltas based on reference build #2209
Recording test results
Setting GRADLE_3_4_RC_2_HOME=/home/jenkins/jenkins-slave/tools/hudson.plugins.gradle.GradleInstallation/Gradle_3.4-rc-2
Setting GRADLE_3_4_RC_2_HOME=/home/jenkins/jenkins-slave/tools/hudson.plugins.gradle.GradleInstallation/Gradle_3.4-rc-2
Not sending mail to unregistered user ismael@juma.me.uk

Mime
View raw message