kafka-dev mailing list archives

Site index · List index
Message view « Date » · « Thread »
Top « Date » · « Thread »
From Apache Jenkins Server <jenk...@builds.apache.org>
Subject Build failed in Jenkins: kafka-trunk-jdk8 #2214
Date Thu, 16 Nov 2017 04:13:44 GMT
See <https://builds.apache.org/job/kafka-trunk-jdk8/2214/display/redirect?page=changes>

Changes:

[ismael] KAFKA-6210; IllegalArgumentException if 1.0.0 is used for

[ismael] MINOR: Updated KafkaZkClient.pathExists() to use ExistsRequest

[wangguoz] KAFKA-6167: Timestamp on streams directory contains a colon, which is an

------------------------------------------
[...truncated 382.23 KB...]

kafka.security.auth.ZkAuthorizationTest > testZkUtils STARTED

kafka.security.auth.ZkAuthorizationTest > testZkUtils PASSED

kafka.security.auth.ZkAuthorizationTest > testZkAntiMigration STARTED

kafka.security.auth.ZkAuthorizationTest > testZkAntiMigration PASSED

kafka.security.auth.ZkAuthorizationTest > testZkMigration STARTED

kafka.security.auth.ZkAuthorizationTest > testZkMigration PASSED

kafka.security.auth.ZkAuthorizationTest > testChroot STARTED

kafka.security.auth.ZkAuthorizationTest > testChroot PASSED

kafka.security.auth.ZkAuthorizationTest > testDelete STARTED

kafka.security.auth.ZkAuthorizationTest > testDelete PASSED

kafka.security.auth.ZkAuthorizationTest > testDeleteRecursive STARTED

kafka.security.auth.ZkAuthorizationTest > testDeleteRecursive PASSED

kafka.security.auth.SimpleAclAuthorizerTest > testAllowAllAccess STARTED

kafka.security.auth.SimpleAclAuthorizerTest > testAllowAllAccess PASSED

kafka.security.auth.SimpleAclAuthorizerTest > testLocalConcurrentModificationOfResourceAcls
STARTED

kafka.security.auth.SimpleAclAuthorizerTest > testLocalConcurrentModificationOfResourceAcls
PASSED

kafka.security.auth.SimpleAclAuthorizerTest > testHighConcurrencyDeletionOfResourceAcls
STARTED

kafka.security.auth.SimpleAclAuthorizerTest > testHighConcurrencyDeletionOfResourceAcls
PASSED

kafka.security.auth.SimpleAclAuthorizerTest > testNoAclFound STARTED

kafka.security.auth.SimpleAclAuthorizerTest > testNoAclFound PASSED

kafka.security.auth.SimpleAclAuthorizerTest > testAclInheritance STARTED

kafka.security.auth.SimpleAclAuthorizerTest > testAclInheritance PASSED

kafka.security.auth.SimpleAclAuthorizerTest > testDistributedConcurrentModificationOfResourceAcls
STARTED

kafka.security.auth.SimpleAclAuthorizerTest > testDistributedConcurrentModificationOfResourceAcls
PASSED

kafka.security.auth.SimpleAclAuthorizerTest > testAclManagementAPIs STARTED

kafka.security.auth.SimpleAclAuthorizerTest > testAclManagementAPIs PASSED

kafka.security.auth.SimpleAclAuthorizerTest > testWildCardAcls STARTED

kafka.security.auth.SimpleAclAuthorizerTest > testWildCardAcls PASSED

kafka.security.auth.SimpleAclAuthorizerTest > testTopicAcl STARTED

kafka.security.auth.SimpleAclAuthorizerTest > testTopicAcl PASSED

kafka.security.auth.SimpleAclAuthorizerTest > testSuperUserHasAccess STARTED

kafka.security.auth.SimpleAclAuthorizerTest > testSuperUserHasAccess PASSED

kafka.security.auth.SimpleAclAuthorizerTest > testDenyTakesPrecedence STARTED

kafka.security.auth.SimpleAclAuthorizerTest > testDenyTakesPrecedence PASSED

kafka.security.auth.SimpleAclAuthorizerTest > testNoAclFoundOverride STARTED

kafka.security.auth.SimpleAclAuthorizerTest > testNoAclFoundOverride PASSED

kafka.security.auth.SimpleAclAuthorizerTest > testHighConcurrencyModificationOfResourceAcls
STARTED

kafka.security.auth.SimpleAclAuthorizerTest > testHighConcurrencyModificationOfResourceAcls
PASSED

kafka.security.auth.SimpleAclAuthorizerTest > testLoadCache STARTED

kafka.security.auth.SimpleAclAuthorizerTest > testLoadCache PASSED

kafka.integration.PrimitiveApiTest > testMultiProduce STARTED

kafka.integration.PrimitiveApiTest > testMultiProduce PASSED

kafka.integration.PrimitiveApiTest > testDefaultEncoderProducerAndFetch STARTED

kafka.integration.PrimitiveApiTest > testDefaultEncoderProducerAndFetch PASSED

kafka.integration.PrimitiveApiTest > testFetchRequestCanProperlySerialize STARTED

kafka.integration.PrimitiveApiTest > testFetchRequestCanProperlySerialize PASSED

kafka.integration.PrimitiveApiTest > testPipelinedProduceRequests STARTED

kafka.integration.PrimitiveApiTest > testPipelinedProduceRequests PASSED

kafka.integration.PrimitiveApiTest > testProduceAndMultiFetch STARTED

kafka.integration.PrimitiveApiTest > testProduceAndMultiFetch PASSED

kafka.integration.PrimitiveApiTest > testDefaultEncoderProducerAndFetchWithCompression
STARTED

kafka.integration.PrimitiveApiTest > testDefaultEncoderProducerAndFetchWithCompression
PASSED

kafka.integration.PrimitiveApiTest > testConsumerEmptyTopic STARTED

kafka.integration.PrimitiveApiTest > testConsumerEmptyTopic PASSED

kafka.integration.PrimitiveApiTest > testEmptyFetchRequest STARTED

kafka.integration.PrimitiveApiTest > testEmptyFetchRequest PASSED

kafka.integration.MetricsDuringTopicCreationDeletionTest > testMetricsDuringTopicCreateDelete
STARTED
ERROR: Could not install GRADLE_3_4_RC_2_HOME
java.lang.NullPointerException
	at hudson.plugins.toolenv.ToolEnvBuildWrapper$1.buildEnvVars(ToolEnvBuildWrapper.java:46)
	at hudson.model.AbstractBuild.getEnvironment(AbstractBuild.java:887)
	at hudson.plugins.git.GitSCM.getParamExpandedRepos(GitSCM.java:421)
	at hudson.plugins.git.GitSCM.compareRemoteRevisionWithImpl(GitSCM.java:629)
	at hudson.plugins.git.GitSCM.compareRemoteRevisionWith(GitSCM.java:594)
	at hudson.scm.SCM.compareRemoteRevisionWith(SCM.java:391)
	at hudson.scm.SCM.poll(SCM.java:408)
	at hudson.model.AbstractProject._poll(AbstractProject.java:1394)
	at hudson.model.AbstractProject.poll(AbstractProject.java:1297)
	at hudson.triggers.SCMTrigger$Runner.runPolling(SCMTrigger.java:594)
	at hudson.triggers.SCMTrigger$Runner.run(SCMTrigger.java:640)
	at hudson.util.SequentialExecutionQueue$QueueEntry.run(SequentialExecutionQueue.java:119)
	at java.util.concurrent.Executors$RunnableAdapter.call(Executors.java:511)
	at java.util.concurrent.FutureTask.run(FutureTask.java:266)
	at java.util.concurrent.ThreadPoolExecutor.runWorker(ThreadPoolExecutor.java:1149)
	at java.util.concurrent.ThreadPoolExecutor$Worker.run(ThreadPoolExecutor.java:624)
	at java.lang.Thread.run(Thread.java:748)

kafka.integration.MetricsDuringTopicCreationDeletionTest > testMetricsDuringTopicCreateDelete
PASSED

kafka.integration.AutoOffsetResetTest > testResetToLatestWhenOffsetTooLow STARTED

kafka.integration.AutoOffsetResetTest > testResetToLatestWhenOffsetTooLow PASSED

kafka.integration.AutoOffsetResetTest > testResetToEarliestWhenOffsetTooLow STARTED

kafka.integration.AutoOffsetResetTest > testResetToEarliestWhenOffsetTooLow PASSED

kafka.integration.AutoOffsetResetTest > testResetToEarliestWhenOffsetTooHigh STARTED

kafka.integration.AutoOffsetResetTest > testResetToEarliestWhenOffsetTooHigh PASSED

kafka.integration.AutoOffsetResetTest > testResetToLatestWhenOffsetTooHigh STARTED

kafka.integration.AutoOffsetResetTest > testResetToLatestWhenOffsetTooHigh PASSED

kafka.integration.TopicMetadataTest > testIsrAfterBrokerShutDownAndJoinsBack STARTED

kafka.integration.TopicMetadataTest > testIsrAfterBrokerShutDownAndJoinsBack PASSED

kafka.integration.TopicMetadataTest > testAutoCreateTopicWithCollision STARTED

kafka.integration.TopicMetadataTest > testAutoCreateTopicWithCollision PASSED

kafka.integration.TopicMetadataTest > testAliveBrokerListWithNoTopics STARTED

kafka.integration.TopicMetadataTest > testAliveBrokerListWithNoTopics PASSED

kafka.integration.TopicMetadataTest > testAutoCreateTopic STARTED

kafka.integration.TopicMetadataTest > testAutoCreateTopic PASSED

kafka.integration.TopicMetadataTest > testGetAllTopicMetadata STARTED

kafka.integration.TopicMetadataTest > testGetAllTopicMetadata PASSED

kafka.integration.TopicMetadataTest > testAliveBrokersListWithNoTopicsAfterNewBrokerStartup
STARTED

kafka.integration.TopicMetadataTest > testAliveBrokersListWithNoTopicsAfterNewBrokerStartup
PASSED

kafka.integration.TopicMetadataTest > testBasicTopicMetadata STARTED

kafka.integration.TopicMetadataTest > testBasicTopicMetadata PASSED

kafka.integration.TopicMetadataTest > testAutoCreateTopicWithInvalidReplication STARTED

kafka.integration.TopicMetadataTest > testAutoCreateTopicWithInvalidReplication PASSED

kafka.integration.TopicMetadataTest > testAliveBrokersListWithNoTopicsAfterABrokerShutdown
STARTED

kafka.integration.TopicMetadataTest > testAliveBrokersListWithNoTopicsAfterABrokerShutdown
PASSED

kafka.integration.FetcherTest > testFetcher STARTED

kafka.integration.FetcherTest > testFetcher PASSED

kafka.integration.UncleanLeaderElectionTest > testUncleanLeaderElectionEnabled STARTED

kafka.integration.UncleanLeaderElectionTest > testUncleanLeaderElectionEnabled PASSED

kafka.integration.UncleanLeaderElectionTest > testCleanLeaderElectionDisabledByTopicOverride
STARTED

kafka.integration.UncleanLeaderElectionTest > testCleanLeaderElectionDisabledByTopicOverride
SKIPPED

kafka.integration.UncleanLeaderElectionTest > testUncleanLeaderElectionDisabled STARTED

kafka.integration.UncleanLeaderElectionTest > testUncleanLeaderElectionDisabled SKIPPED

kafka.integration.UncleanLeaderElectionTest > testUncleanLeaderElectionInvalidTopicOverride
STARTED

kafka.integration.UncleanLeaderElectionTest > testUncleanLeaderElectionInvalidTopicOverride
PASSED

kafka.integration.UncleanLeaderElectionTest > testUncleanLeaderElectionEnabledByTopicOverride
STARTED

kafka.integration.UncleanLeaderElectionTest > testUncleanLeaderElectionEnabledByTopicOverride
PASSED

kafka.integration.MinIsrConfigTest > testDefaultKafkaConfig STARTED

kafka.integration.MinIsrConfigTest > testDefaultKafkaConfig PASSED

1710 tests completed, 1 failed, 4 skipped
:kafka-trunk-jdk8:core:test FAILED
:test_core_2_11 FAILED

FAILURE: Build failed with an exception.

* What went wrong:
Execution failed for task ':kafka-trunk-jdk8:core:test'.
> There were failing tests. See the report at: file://<https://builds.apache.org/job/kafka-trunk-jdk8/ws/core/build/reports/tests/test/index.html>

* Try:
Run with --stacktrace option to get the stack trace. Run with --info or --debug option to
get more log output.

* Get more help at https://help.gradle.org

BUILD FAILED in 58m 17s
16 actionable tasks: 15 executed, 1 up-to-date
Build step 'Execute shell' marked build as failure
[FINDBUGS] Collecting findbugs analysis files...
Setting GRADLE_3_4_RC_2_HOME=/home/jenkins/jenkins-slave/tools/hudson.plugins.gradle.GradleInstallation/Gradle_3.4-rc-2
[FINDBUGS] Searching for all files in <https://builds.apache.org/job/kafka-trunk-jdk8/ws/>
that match the pattern **/build/reports/findbugs/*.xml
[FINDBUGS] Parsing 1 file in <https://builds.apache.org/job/kafka-trunk-jdk8/ws/>
[FINDBUGS] Successfully parsed file <https://builds.apache.org/job/kafka-trunk-jdk8/ws/core/build/reports/findbugs/main.xml>
with 0 unique warnings and 0 duplicates.
Setting GRADLE_3_4_RC_2_HOME=/home/jenkins/jenkins-slave/tools/hudson.plugins.gradle.GradleInstallation/Gradle_3.4-rc-2
Setting GRADLE_3_4_RC_2_HOME=/home/jenkins/jenkins-slave/tools/hudson.plugins.gradle.GradleInstallation/Gradle_3.4-rc-2
<Git Blamer> Using GitBlamer to create author and commit information for all warnings.
<Git Blamer> GIT_COMMIT=539c4d53f8fac65063e4e519c6a51911550a151f, workspace=<https://builds.apache.org/job/kafka-trunk-jdk8/ws/>
[FINDBUGS] Computing warning deltas based on reference build #2213
Recording test results
Setting GRADLE_3_4_RC_2_HOME=/home/jenkins/jenkins-slave/tools/hudson.plugins.gradle.GradleInstallation/Gradle_3.4-rc-2
Setting GRADLE_3_4_RC_2_HOME=/home/jenkins/jenkins-slave/tools/hudson.plugins.gradle.GradleInstallation/Gradle_3.4-rc-2
Not sending mail to unregistered user ismael@juma.me.uk
Not sending mail to unregistered user wangguoz@gmail.com

Mime
View raw message