kafka-dev mailing list archives

Site index · List index
Message view « Date » · « Thread »
Top « Date » · « Thread »
From Apache Jenkins Server <jenk...@builds.apache.org>
Subject Build failed in Jenkins: kafka-trunk-jdk7 #2872
Date Mon, 09 Oct 2017 21:23:58 GMT
See <https://builds.apache.org/job/kafka-trunk-jdk7/2872/display/redirect?page=changes>

Changes:

[jason] MINOR: Factor out some common group/transactional fields in request

------------------------------------------
[...truncated 370.58 KB...]
kafka.server.ServerGenerateBrokerIdTest > testMultipleLogDirsMetaProps PASSED

kafka.server.ServerGenerateBrokerIdTest > testDisableGeneratedBrokerId STARTED

kafka.server.ServerGenerateBrokerIdTest > testDisableGeneratedBrokerId PASSED

kafka.server.ServerGenerateBrokerIdTest > testUserConfigAndGeneratedBrokerId STARTED

kafka.server.ServerGenerateBrokerIdTest > testUserConfigAndGeneratedBrokerId PASSED

kafka.server.ServerGenerateBrokerIdTest > testConsistentBrokerIdFromUserConfigAndMetaProps
STARTED

kafka.server.ServerGenerateBrokerIdTest > testConsistentBrokerIdFromUserConfigAndMetaProps
PASSED

kafka.server.DelayedOperationTest > testRequestPurge STARTED

kafka.server.DelayedOperationTest > testRequestPurge PASSED

kafka.server.DelayedOperationTest > testRequestExpiry STARTED

kafka.server.DelayedOperationTest > testRequestExpiry PASSED

kafka.server.DelayedOperationTest > shouldReturnNilOperationsOnCancelForKeyWhenKeyDoesntExist
STARTED

kafka.server.DelayedOperationTest > shouldReturnNilOperationsOnCancelForKeyWhenKeyDoesntExist
PASSED

kafka.server.DelayedOperationTest > shouldCancelForKeyReturningCancelledOperations STARTED

kafka.server.DelayedOperationTest > shouldCancelForKeyReturningCancelledOperations PASSED

kafka.server.DelayedOperationTest > testRequestSatisfaction STARTED

kafka.server.DelayedOperationTest > testRequestSatisfaction PASSED

kafka.server.DelayedOperationTest > testDelayedOperationLock STARTED

kafka.server.DelayedOperationTest > testDelayedOperationLock PASSED

kafka.server.MultipleListenersWithDefaultJaasContextTest > testProduceConsume STARTED

kafka.server.MultipleListenersWithDefaultJaasContextTest > testProduceConsume PASSED

kafka.server.ThrottledResponseExpirationTest > testThrottledRequest STARTED

kafka.server.ThrottledResponseExpirationTest > testThrottledRequest PASSED

kafka.server.ThrottledResponseExpirationTest > testExpire STARTED

kafka.server.ThrottledResponseExpirationTest > testExpire PASSED

kafka.server.ReplicaManagerQuotasTest > shouldGetBothMessagesIfQuotasAllow STARTED

kafka.server.ReplicaManagerQuotasTest > shouldGetBothMessagesIfQuotasAllow PASSED

kafka.server.ReplicaManagerQuotasTest > shouldExcludeSubsequentThrottledPartitions STARTED

kafka.server.ReplicaManagerQuotasTest > shouldExcludeSubsequentThrottledPartitions PASSED

kafka.server.ReplicaManagerQuotasTest > shouldGetNoMessagesIfQuotasExceededOnSubsequentPartitions
STARTED

kafka.server.ReplicaManagerQuotasTest > shouldGetNoMessagesIfQuotasExceededOnSubsequentPartitions
PASSED

kafka.server.ReplicaManagerQuotasTest > shouldIncludeInSyncThrottledReplicas STARTED

kafka.server.ReplicaManagerQuotasTest > shouldIncludeInSyncThrottledReplicas PASSED

kafka.server.SaslApiVersionsRequestTest > testApiVersionsRequestWithUnsupportedVersion
STARTED

kafka.server.SaslApiVersionsRequestTest > testApiVersionsRequestWithUnsupportedVersion
PASSED

kafka.server.SaslApiVersionsRequestTest > testApiVersionsRequestBeforeSaslHandshakeRequest
STARTED

kafka.server.SaslApiVersionsRequestTest > testApiVersionsRequestBeforeSaslHandshakeRequest
PASSED

kafka.server.SaslApiVersionsRequestTest > testApiVersionsRequestAfterSaslHandshakeRequest
STARTED

kafka.server.SaslApiVersionsRequestTest > testApiVersionsRequestAfterSaslHandshakeRequest
PASSED

kafka.server.ControlledShutdownLeaderSelectorTest > testSelectLeader STARTED

kafka.server.ControlledShutdownLeaderSelectorTest > testSelectLeader PASSED

kafka.server.MetadataCacheTest > getTopicMetadataWithNonSupportedSecurityProtocol STARTED

kafka.server.MetadataCacheTest > getTopicMetadataWithNonSupportedSecurityProtocol PASSED

kafka.server.MetadataCacheTest > getTopicMetadataIsrNotAvailable STARTED

kafka.server.MetadataCacheTest > getTopicMetadataIsrNotAvailable PASSED

kafka.server.MetadataCacheTest > getTopicMetadata STARTED

kafka.server.MetadataCacheTest > getTopicMetadata PASSED

kafka.server.MetadataCacheTest > getTopicMetadataReplicaNotAvailable STARTED

kafka.server.MetadataCacheTest > getTopicMetadataReplicaNotAvailable PASSED

kafka.server.MetadataCacheTest > getTopicMetadataPartitionLeaderNotAvailable STARTED

kafka.server.MetadataCacheTest > getTopicMetadataPartitionLeaderNotAvailable PASSED

kafka.server.MetadataCacheTest > getAliveBrokersShouldNotBeMutatedByUpdateCache STARTED

kafka.server.MetadataCacheTest > getAliveBrokersShouldNotBeMutatedByUpdateCache PASSED

kafka.server.MetadataCacheTest > getTopicMetadataNonExistingTopics STARTED

kafka.server.MetadataCacheTest > getTopicMetadataNonExistingTopics PASSED

kafka.server.FetchRequestTest > testBrokerRespectsPartitionsOrderAndSizeLimits STARTED

kafka.server.FetchRequestTest > testBrokerRespectsPartitionsOrderAndSizeLimits PASSED

kafka.server.FetchRequestTest > testDownConversionFromBatchedToUnbatchedRespectsOffset
STARTED

kafka.server.FetchRequestTest > testDownConversionFromBatchedToUnbatchedRespectsOffset
PASSED

kafka.server.FetchRequestTest > testFetchRequestV2WithOversizedMessage STARTED

kafka.server.FetchRequestTest > testFetchRequestV2WithOversizedMessage PASSED

kafka.server.checkpoints.OffsetCheckpointFileTest > shouldReturnEmptyMapForEmptyFile STARTED

kafka.server.checkpoints.OffsetCheckpointFileTest > shouldReturnEmptyMapForEmptyFile PASSED

kafka.server.checkpoints.OffsetCheckpointFileTest > shouldThrowIfVersionIsNotRecognised
STARTED

kafka.server.checkpoints.OffsetCheckpointFileTest > shouldThrowIfVersionIsNotRecognised
PASSED

kafka.server.checkpoints.OffsetCheckpointFileTest > shouldPersistAndOverwriteAndReloadFile
STARTED

kafka.server.checkpoints.OffsetCheckpointFileTest > shouldPersistAndOverwriteAndReloadFile
PASSED

kafka.server.checkpoints.OffsetCheckpointFileTest > shouldHandleMultipleLines STARTED

kafka.server.checkpoints.OffsetCheckpointFileTest > shouldHandleMultipleLines PASSED

kafka.server.checkpoints.LeaderEpochCheckpointFileTest > shouldPersistAndOverwriteAndReloadFile
STARTED

kafka.server.checkpoints.LeaderEpochCheckpointFileTest > shouldPersistAndOverwriteAndReloadFile
PASSED

kafka.server.checkpoints.LeaderEpochCheckpointFileTest > shouldRetainValuesEvenIfCheckpointIsRecreated
STARTED

kafka.server.checkpoints.LeaderEpochCheckpointFileTest > shouldRetainValuesEvenIfCheckpointIsRecreated
PASSED

kafka.server.ReplicaFetchTest > testReplicaFetcherThread STARTED

kafka.server.ReplicaFetchTest > testReplicaFetcherThread PASSED

kafka.server.KafkaMetricReporterClusterIdTest > testClusterIdPresent STARTED

kafka.server.KafkaMetricReporterClusterIdTest > testClusterIdPresent PASSED

unit.kafka.server.KafkaApisTest > shouldRespondWithUnsupportedForMessageFormatOnHandleWriteTxnMarkersWhenMagicLowerThanRequired
STARTED

unit.kafka.server.KafkaApisTest > shouldRespondWithUnsupportedForMessageFormatOnHandleWriteTxnMarkersWhenMagicLowerThanRequired
PASSED

unit.kafka.server.KafkaApisTest > shouldThrowUnsupportedVersionExceptionOnHandleTxnOffsetCommitRequestWhenInterBrokerProtocolNotSupported
STARTED

unit.kafka.server.KafkaApisTest > shouldThrowUnsupportedVersionExceptionOnHandleTxnOffsetCommitRequestWhenInterBrokerProtocolNotSupported
PASSED

unit.kafka.server.KafkaApisTest > shouldThrowUnsupportedVersionExceptionOnHandleAddPartitionsToTxnRequestWhenInterBrokerProtocolNotSupported
STARTED

unit.kafka.server.KafkaApisTest > shouldThrowUnsupportedVersionExceptionOnHandleAddPartitionsToTxnRequestWhenInterBrokerProtocolNotSupported
PASSED

unit.kafka.server.KafkaApisTest > testReadUncommittedConsumerListOffsetLatest STARTED

unit.kafka.server.KafkaApisTest > testReadUncommittedConsumerListOffsetLatest PASSED

unit.kafka.server.KafkaApisTest > shouldAppendToLogOnWriteTxnMarkersWhenCorrectMagicVersion
STARTED

unit.kafka.server.KafkaApisTest > shouldAppendToLogOnWriteTxnMarkersWhenCorrectMagicVersion
PASSED

unit.kafka.server.KafkaApisTest > shouldThrowUnsupportedVersionExceptionOnHandleWriteTxnMarkersRequestWhenInterBrokerProtocolNotSupported
STARTED

unit.kafka.server.KafkaApisTest > shouldThrowUnsupportedVersionExceptionOnHandleWriteTxnMarkersRequestWhenInterBrokerProtocolNotSupported
PASSED

unit.kafka.server.KafkaApisTest > shouldRespondWithUnknownTopicWhenPartitionIsNotHosted
STARTED

unit.kafka.server.KafkaApisTest > shouldRespondWithUnknownTopicWhenPartitionIsNotHosted
PASSED

unit.kafka.server.KafkaApisTest > testReadCommittedConsumerListOffsetEarliestOffsetEqualsLastStableOffset
STARTED

unit.kafka.server.KafkaApisTest > testReadCommittedConsumerListOffsetEarliestOffsetEqualsLastStableOffset
PASSED

unit.kafka.server.KafkaApisTest > testReadCommittedConsumerListOffsetLatest STARTED

unit.kafka.server.KafkaApisTest > testReadCommittedConsumerListOffsetLatest PASSED

unit.kafka.server.KafkaApisTest > testReadCommittedConsumerListOffsetLimitedAtLastStableOffset
STARTED

unit.kafka.server.KafkaApisTest > testReadCommittedConsumerListOffsetLimitedAtLastStableOffset
PASSED

unit.kafka.server.KafkaApisTest > testReadUncommittedConsumerListOffsetEarliestOffsetEqualsHighWatermark
STARTED

unit.kafka.server.KafkaApisTest > testReadUncommittedConsumerListOffsetEarliestOffsetEqualsHighWatermark
PASSED

unit.kafka.server.KafkaApisTest > testReadUncommittedConsumerListOffsetLimitedAtHighWatermark
STARTED

unit.kafka.server.KafkaApisTest > testReadUncommittedConsumerListOffsetLimitedAtHighWatermark
PASSED

unit.kafka.server.KafkaApisTest > shouldThrowUnsupportedVersionExceptionOnHandleAddOffsetToTxnRequestWhenInterBrokerProtocolNotSupported
STARTED

unit.kafka.server.KafkaApisTest > shouldThrowUnsupportedVersionExceptionOnHandleAddOffsetToTxnRequestWhenInterBrokerProtocolNotSupported
PASSED

unit.kafka.server.KafkaApisTest > shouldRespondWithUnsupportedMessageFormatForBadPartitionAndNoErrorsForGoodPartition
STARTED

unit.kafka.server.KafkaApisTest > shouldRespondWithUnsupportedMessageFormatForBadPartitionAndNoErrorsForGoodPartition
PASSED

unit.kafka.server.KafkaApisTest > shouldThrowUnsupportedVersionExceptionOnHandleEndTxnRequestWhenInterBrokerProtocolNotSupported
STARTED

unit.kafka.server.KafkaApisTest > shouldThrowUnsupportedVersionExceptionOnHandleEndTxnRequestWhenInterBrokerProtocolNotSupported
PASSED

unit.kafka.server.KafkaApisTest > shouldRespondWithUnknownTopicOrPartitionForBadPartitionAndNoErrorsForGoodPartition
STARTED

unit.kafka.server.KafkaApisTest > shouldRespondWithUnknownTopicOrPartitionForBadPartitionAndNoErrorsForGoodPartition
PASSED

1616 tests completed, 1 failed, 4 skipped
:kafka-trunk-jdk7:core:test FAILED
:test_core_2_11 FAILED

FAILURE: Build failed with an exception.

* What went wrong:
Execution failed for task ':kafka-trunk-jdk7:core:test'.
> There were failing tests. See the report at: file://<https://builds.apache.org/job/kafka-trunk-jdk7/ws/core/build/reports/tests/test/index.html>

* Try:
Run with --stacktrace option to get the stack trace. Run with --info or --debug option to
get more log output.

* Get more help at https://help.gradle.org

BUILD FAILED in 1h 0m 17s
16 actionable tasks: 13 executed, 3 up-to-date
Build step 'Execute shell' marked build as failure
[FINDBUGS] Collecting findbugs analysis files...
Setting GRADLE_3_4_RC_2_HOME=/home/jenkins/jenkins-slave/tools/hudson.plugins.gradle.GradleInstallation/Gradle_3.4-rc-2
[FINDBUGS] Searching for all files in <https://builds.apache.org/job/kafka-trunk-jdk7/ws/>
that match the pattern **/build/reports/findbugs/*.xml
[FINDBUGS] Parsing 1 file in <https://builds.apache.org/job/kafka-trunk-jdk7/ws/>
[FINDBUGS] Successfully parsed file <https://builds.apache.org/job/kafka-trunk-jdk7/ws/core/build/reports/findbugs/main.xml>
with 0 unique warnings and 0 duplicates.
Setting GRADLE_3_4_RC_2_HOME=/home/jenkins/jenkins-slave/tools/hudson.plugins.gradle.GradleInstallation/Gradle_3.4-rc-2
Setting GRADLE_3_4_RC_2_HOME=/home/jenkins/jenkins-slave/tools/hudson.plugins.gradle.GradleInstallation/Gradle_3.4-rc-2
<Git Blamer> Using GitBlamer to create author and commit information for all warnings.
<Git Blamer> GIT_COMMIT=f4ac68a400a8289704a5888bf62f1d93e7aee99d, workspace=<https://builds.apache.org/job/kafka-trunk-jdk7/ws/>
[FINDBUGS] Computing warning deltas based on reference build #2871
Recording test results
Setting GRADLE_3_4_RC_2_HOME=/home/jenkins/jenkins-slave/tools/hudson.plugins.gradle.GradleInstallation/Gradle_3.4-rc-2
Setting GRADLE_3_4_RC_2_HOME=/home/jenkins/jenkins-slave/tools/hudson.plugins.gradle.GradleInstallation/Gradle_3.4-rc-2

Mime
View raw message