kafka-dev mailing list archives

Site index · List index
Message view « Date » · « Thread »
Top « Date » · « Thread »
From Apache Jenkins Server <jenk...@builds.apache.org>
Subject Build failed in Jenkins: kafka-trunk-jdk8 #2095
Date Tue, 03 Oct 2017 15:56:54 GMT
See <https://builds.apache.org/job/kafka-trunk-jdk8/2095/display/redirect?page=changes>

Changes:

[damian.guy] MINOR: fix JavaDocs warnings

------------------------------------------
[...truncated 2.95 MB...]
org.apache.kafka.common.security.JaasContextTest > testControlFlag PASSED

org.apache.kafka.common.security.plain.PlainSaslServerTest > noAuthorizationIdSpecified
STARTED

org.apache.kafka.common.security.plain.PlainSaslServerTest > noAuthorizationIdSpecified
PASSED

org.apache.kafka.common.security.plain.PlainSaslServerTest > authorizatonIdEqualsAuthenticationId
STARTED

org.apache.kafka.common.security.plain.PlainSaslServerTest > authorizatonIdEqualsAuthenticationId
PASSED

org.apache.kafka.common.security.plain.PlainSaslServerTest > authorizatonIdNotEqualsAuthenticationId
STARTED

org.apache.kafka.common.security.plain.PlainSaslServerTest > authorizatonIdNotEqualsAuthenticationId
PASSED

org.apache.kafka.common.security.authenticator.ClientAuthenticationFailureTest > testProducerWithInvalidCredentials
STARTED

org.apache.kafka.common.security.authenticator.ClientAuthenticationFailureTest > testProducerWithInvalidCredentials
PASSED

org.apache.kafka.common.security.authenticator.ClientAuthenticationFailureTest > testTransactionalProducerWithInvalidCredentials
STARTED

org.apache.kafka.common.security.authenticator.ClientAuthenticationFailureTest > testTransactionalProducerWithInvalidCredentials
PASSED

org.apache.kafka.common.security.authenticator.ClientAuthenticationFailureTest > testConsumerWithInvalidCredentials
STARTED

org.apache.kafka.common.security.authenticator.ClientAuthenticationFailureTest > testConsumerWithInvalidCredentials
PASSED

org.apache.kafka.common.security.authenticator.ClientAuthenticationFailureTest > testAdminClientWithInvalidCredentials
STARTED

org.apache.kafka.common.security.authenticator.ClientAuthenticationFailureTest > testAdminClientWithInvalidCredentials
PASSED

org.apache.kafka.common.security.authenticator.SaslAuthenticatorTest > testMissingUsernameSaslPlain
STARTED

org.apache.kafka.common.security.authenticator.SaslAuthenticatorTest > testMissingUsernameSaslPlain
PASSED

org.apache.kafka.common.security.authenticator.SaslAuthenticatorTest > testValidSaslScramMechanisms
STARTED

org.apache.kafka.common.security.authenticator.SaslAuthenticatorTest > testValidSaslScramMechanisms
PASSED

org.apache.kafka.common.security.authenticator.SaslAuthenticatorTest > oldSaslScramSslServerWithoutSaslAuthenticateHeaderFailure
STARTED

org.apache.kafka.common.security.authenticator.SaslAuthenticatorTest > oldSaslScramSslServerWithoutSaslAuthenticateHeaderFailure
PASSED

org.apache.kafka.common.security.authenticator.SaslAuthenticatorTest > oldSaslScramPlaintextServerWithoutSaslAuthenticateHeaderFailure
STARTED

org.apache.kafka.common.security.authenticator.SaslAuthenticatorTest > oldSaslScramPlaintextServerWithoutSaslAuthenticateHeaderFailure
PASSED

org.apache.kafka.common.security.authenticator.SaslAuthenticatorTest > oldSaslScramPlaintextServerWithoutSaslAuthenticateHeader
STARTED

org.apache.kafka.common.security.authenticator.SaslAuthenticatorTest > oldSaslScramPlaintextServerWithoutSaslAuthenticateHeader
PASSED

org.apache.kafka.common.security.authenticator.SaslAuthenticatorTest > testMechanismPluggability
STARTED

org.apache.kafka.common.security.authenticator.SaslAuthenticatorTest > testMechanismPluggability
PASSED

org.apache.kafka.common.security.authenticator.SaslAuthenticatorTest > testScramUsernameWithSpecialCharacters
STARTED

org.apache.kafka.common.security.authenticator.SaslAuthenticatorTest > testScramUsernameWithSpecialCharacters
PASSED

org.apache.kafka.common.security.authenticator.SaslAuthenticatorTest > testApiVersionsRequestWithUnsupportedVersion
STARTED

org.apache.kafka.common.security.authenticator.SaslAuthenticatorTest > testApiVersionsRequestWithUnsupportedVersion
PASSED

org.apache.kafka.common.security.authenticator.SaslAuthenticatorTest > testMissingPasswordSaslPlain
STARTED

org.apache.kafka.common.security.authenticator.SaslAuthenticatorTest > testMissingPasswordSaslPlain
PASSED

org.apache.kafka.common.security.authenticator.SaslAuthenticatorTest > testInvalidLoginModule
STARTED

org.apache.kafka.common.security.authenticator.SaslAuthenticatorTest > testInvalidLoginModule
PASSED

org.apache.kafka.common.security.authenticator.SaslAuthenticatorTest > oldSaslPlainPlaintextClientWithoutSaslAuthenticateHeader
STARTED

org.apache.kafka.common.security.authenticator.SaslAuthenticatorTest > oldSaslPlainPlaintextClientWithoutSaslAuthenticateHeader
PASSED

org.apache.kafka.common.security.authenticator.SaslAuthenticatorTest > oldSaslPlainSslClientWithoutSaslAuthenticateHeader
STARTED

org.apache.kafka.common.security.authenticator.SaslAuthenticatorTest > oldSaslPlainSslClientWithoutSaslAuthenticateHeader
PASSED

org.apache.kafka.common.security.authenticator.SaslAuthenticatorTest > oldSaslPlainSslClientWithoutSaslAuthenticateHeaderFailure
STARTED

org.apache.kafka.common.security.authenticator.SaslAuthenticatorTest > oldSaslPlainSslClientWithoutSaslAuthenticateHeaderFailure
PASSED

org.apache.kafka.common.security.authenticator.SaslAuthenticatorTest > testValidSaslScramSha256
STARTED

org.apache.kafka.common.security.authenticator.SaslAuthenticatorTest > testValidSaslScramSha256
PASSED

org.apache.kafka.common.security.authenticator.SaslAuthenticatorTest > oldSaslPlainPlaintextServerWithoutSaslAuthenticateHeaderFailure
STARTED

org.apache.kafka.common.security.authenticator.SaslAuthenticatorTest > oldSaslPlainPlaintextServerWithoutSaslAuthenticateHeaderFailure
PASSED

org.apache.kafka.common.security.authenticator.SaslAuthenticatorTest > testInvalidMechanism
STARTED

org.apache.kafka.common.security.authenticator.SaslAuthenticatorTest > testInvalidMechanism
PASSED

org.apache.kafka.common.security.authenticator.SaslAuthenticatorTest > testDisabledMechanism
STARTED

org.apache.kafka.common.security.authenticator.SaslAuthenticatorTest > testDisabledMechanism
PASSED

org.apache.kafka.common.security.authenticator.SaslAuthenticatorTest > testDynamicJaasConfiguration
STARTED

org.apache.kafka.common.security.authenticator.SaslAuthenticatorTest > testDynamicJaasConfiguration
PASSED

org.apache.kafka.common.security.authenticator.SaslAuthenticatorTest > oldSaslScramSslClientWithoutSaslAuthenticateHeader
STARTED

org.apache.kafka.common.security.authenticator.SaslAuthenticatorTest > oldSaslScramSslClientWithoutSaslAuthenticateHeader
PASSED

org.apache.kafka.common.security.authenticator.SaslAuthenticatorTest > testUnauthenticatedApiVersionsRequestOverPlaintextHandshakeVersion0
STARTED

org.apache.kafka.common.security.authenticator.SaslAuthenticatorTest > testUnauthenticatedApiVersionsRequestOverPlaintextHandshakeVersion0
PASSED

org.apache.kafka.common.security.authenticator.SaslAuthenticatorTest > testUnauthenticatedApiVersionsRequestOverPlaintextHandshakeVersion1
STARTED

org.apache.kafka.common.security.authenticator.SaslAuthenticatorTest > testUnauthenticatedApiVersionsRequestOverPlaintextHandshakeVersion1
PASSED

org.apache.kafka.common.security.authenticator.SaslAuthenticatorTest > testPacketSizeTooBig
STARTED

org.apache.kafka.common.security.authenticator.SaslAuthenticatorTest > testPacketSizeTooBig
PASSED

org.apache.kafka.common.security.authenticator.SaslAuthenticatorTest > oldSaslScramPlaintextClientWithoutSaslAuthenticateHeader
STARTED

org.apache.kafka.common.security.authenticator.SaslAuthenticatorTest > oldSaslScramPlaintextClientWithoutSaslAuthenticateHeader
PASSED

org.apache.kafka.common.security.authenticator.SaslAuthenticatorTest > oldSaslScramSslClientWithoutSaslAuthenticateHeaderFailure
STARTED

org.apache.kafka.common.security.authenticator.SaslAuthenticatorTest > oldSaslScramSslClientWithoutSaslAuthenticateHeaderFailure
PASSED

org.apache.kafka.common.security.authenticator.SaslAuthenticatorTest > oldSaslScramPlaintextClientWithoutSaslAuthenticateHeaderFailure
STARTED

org.apache.kafka.common.security.authenticator.SaslAuthenticatorTest > oldSaslScramPlaintextClientWithoutSaslAuthenticateHeaderFailure
PASSED

org.apache.kafka.common.security.authenticator.SaslAuthenticatorTest > testInvalidUsernameSaslPlain
STARTED

org.apache.kafka.common.security.authenticator.SaslAuthenticatorTest > testInvalidUsernameSaslPlain
PASSED

org.apache.kafka.common.security.authenticator.SaslAuthenticatorTest > testUserCredentialsUnavailableForScramMechanism
STARTED

org.apache.kafka.common.security.authenticator.SaslAuthenticatorTest > testUserCredentialsUnavailableForScramMechanism
PASSED

org.apache.kafka.common.security.authenticator.SaslAuthenticatorTest > testUnauthenticatedApiVersionsRequestOverSslHandshakeVersion0
STARTED

org.apache.kafka.common.security.authenticator.SaslAuthenticatorTest > testUnauthenticatedApiVersionsRequestOverSslHandshakeVersion0
PASSED

org.apache.kafka.common.security.authenticator.SaslAuthenticatorTest > testUnauthenticatedApiVersionsRequestOverSslHandshakeVersion1
STARTED

org.apache.kafka.common.security.authenticator.SaslAuthenticatorTest > testUnauthenticatedApiVersionsRequestOverSslHandshakeVersion1
PASSED

org.apache.kafka.common.security.authenticator.SaslAuthenticatorTest > testMultipleServerMechanisms
STARTED

org.apache.kafka.common.security.authenticator.SaslAuthenticatorTest > testMultipleServerMechanisms
PASSED

org.apache.kafka.common.security.authenticator.SaslAuthenticatorTest > testValidSaslPlainOverPlaintext
STARTED

org.apache.kafka.common.security.authenticator.SaslAuthenticatorTest > testValidSaslPlainOverPlaintext
PASSED

org.apache.kafka.common.security.authenticator.SaslAuthenticatorTest > testValidSaslPlainOverSsl
STARTED

org.apache.kafka.common.security.authenticator.SaslAuthenticatorTest > testValidSaslPlainOverSsl
PASSED

org.apache.kafka.common.security.authenticator.SaslAuthenticatorTest > testInvalidApiVersionsRequestSequence
STARTED

org.apache.kafka.common.security.authenticator.SaslAuthenticatorTest > testInvalidApiVersionsRequestSequence
PASSED

org.apache.kafka.common.security.authenticator.SaslAuthenticatorTest > testDisallowedKafkaRequestsBeforeAuthentication
STARTED

org.apache.kafka.common.security.authenticator.SaslAuthenticatorTest > testDisallowedKafkaRequestsBeforeAuthentication
PASSED

org.apache.kafka.common.security.authenticator.SaslAuthenticatorTest > oldSaslPlainPlaintextServerWithoutSaslAuthenticateHeader
STARTED

org.apache.kafka.common.security.authenticator.SaslAuthenticatorTest > oldSaslPlainPlaintextServerWithoutSaslAuthenticateHeader
PASSED

org.apache.kafka.common.security.authenticator.SaslAuthenticatorTest > oldSaslPlainSslServerWithoutSaslAuthenticateHeader
STARTED

org.apache.kafka.common.security.authenticator.SaslAuthenticatorTest > oldSaslPlainSslServerWithoutSaslAuthenticateHeader
PASSED

org.apache.kafka.common.security.authenticator.SaslAuthenticatorTest > testInvalidPasswordSaslPlain
STARTED

org.apache.kafka.common.security.authenticator.SaslAuthenticatorTest > testInvalidPasswordSaslPlain
PASSED

org.apache.kafka.common.security.authenticator.SaslAuthenticatorTest > testInvalidPasswordSaslScram
STARTED

org.apache.kafka.common.security.authenticator.SaslAuthenticatorTest > testInvalidPasswordSaslScram
PASSED

org.apache.kafka.common.security.authenticator.SaslAuthenticatorTest > oldSaslPlainSslServerWithoutSaslAuthenticateHeaderFailure
STARTED

org.apache.kafka.common.security.authenticator.SaslAuthenticatorTest > oldSaslPlainSslServerWithoutSaslAuthenticateHeaderFailure
PASSED

org.apache.kafka.common.security.authenticator.SaslAuthenticatorTest > testInvalidSaslPacket
STARTED

org.apache.kafka.common.security.authenticator.SaslAuthenticatorTest > testInvalidSaslPacket
PASSED

org.apache.kafka.common.security.authenticator.SaslAuthenticatorTest > testSaslHandshakeRequestWithUnsupportedVersion
STARTED

org.apache.kafka.common.security.authenticator.SaslAuthenticatorTest > testSaslHandshakeRequestWithUnsupportedVersion
PASSED

org.apache.kafka.common.security.authenticator.SaslAuthenticatorTest > testJaasConfigurationForListener
STARTED

org.apache.kafka.common.security.authenticator.SaslAuthenticatorTest > testJaasConfigurationForListener
PASSED

org.apache.kafka.common.security.authenticator.SaslAuthenticatorTest > oldSaslPlainPlaintextClientWithoutSaslAuthenticateHeaderFailure
STARTED

org.apache.kafka.common.security.authenticator.SaslAuthenticatorTest > oldSaslPlainPlaintextClientWithoutSaslAuthenticateHeaderFailure
PASSED

org.apache.kafka.common.security.authenticator.SaslAuthenticatorTest > testUnknownUserSaslScram
STARTED

org.apache.kafka.common.security.authenticator.SaslAuthenticatorTest > testUnknownUserSaslScram
PASSED

org.apache.kafka.common.security.authenticator.SaslAuthenticatorTest > oldSaslScramSslServerWithoutSaslAuthenticateHeader
STARTED

org.apache.kafka.common.security.authenticator.SaslAuthenticatorTest > oldSaslScramSslServerWithoutSaslAuthenticateHeader
PASSED

org.apache.kafka.common.security.authenticator.SaslServerAuthenticatorTest > testUnexpectedRequestType
STARTED

org.apache.kafka.common.security.authenticator.SaslServerAuthenticatorTest > testUnexpectedRequestType
PASSED

org.apache.kafka.common.security.authenticator.SaslServerAuthenticatorTest > testOversizeRequest
STARTED

org.apache.kafka.common.security.authenticator.SaslServerAuthenticatorTest > testOversizeRequest
PASSED

3997 tests completed, 1 failed, 1 skipped
:clients:test FAILED

FAILURE: Build failed with an exception.

* What went wrong:
Execution failed for task ':clients:test'.
> There were failing tests. See the report at: file://<https://builds.apache.org/job/kafka-trunk-jdk8/ws/clients/build/reports/tests/test/index.html>

* Try:
Run with --stacktrace option to get the stack trace. Run with --info or --debug option to
get more log output.

* Get more help at https://help.gradle.org

BUILD FAILED in 4m 16s
23 actionable tasks: 20 executed, 3 up-to-date
Build step 'Execute shell' marked build as failure
[FINDBUGS] Collecting findbugs analysis files...
Setting GRADLE_3_4_RC_2_HOME=/home/jenkins/jenkins-slave/tools/hudson.plugins.gradle.GradleInstallation/Gradle_3.4-rc-2
[FINDBUGS] Searching for all files in <https://builds.apache.org/job/kafka-trunk-jdk8/ws/>
that match the pattern **/build/reports/findbugs/*.xml
[FINDBUGS] Parsing 1 file in <https://builds.apache.org/job/kafka-trunk-jdk8/ws/>
[FINDBUGS] Successfully parsed file <https://builds.apache.org/job/kafka-trunk-jdk8/ws/clients/build/reports/findbugs/main.xml>
with 0 unique warnings and 0 duplicates.
Setting GRADLE_3_4_RC_2_HOME=/home/jenkins/jenkins-slave/tools/hudson.plugins.gradle.GradleInstallation/Gradle_3.4-rc-2
Setting GRADLE_3_4_RC_2_HOME=/home/jenkins/jenkins-slave/tools/hudson.plugins.gradle.GradleInstallation/Gradle_3.4-rc-2
<Git Blamer> Using GitBlamer to create author and commit information for all warnings.
<Git Blamer> GIT_COMMIT=3dcbbf703017985c9e212ad69cc7afdddbf358eb, workspace=<https://builds.apache.org/job/kafka-trunk-jdk8/ws/>
[FINDBUGS] Computing warning deltas based on reference build #2094
Recording test results
Setting GRADLE_3_4_RC_2_HOME=/home/jenkins/jenkins-slave/tools/hudson.plugins.gradle.GradleInstallation/Gradle_3.4-rc-2
Setting GRADLE_3_4_RC_2_HOME=/home/jenkins/jenkins-slave/tools/hudson.plugins.gradle.GradleInstallation/Gradle_3.4-rc-2
Not sending mail to unregistered user damian.guy@gmail.com

Mime
View raw message