kafka-dev mailing list archives

Site index · List index
Message view « Date » · « Thread »
Top « Date » · « Thread »
From Apache Jenkins Server <jenk...@builds.apache.org>
Subject Build failed in Jenkins: kafka-trunk-jdk8 #1986
Date Thu, 07 Sep 2017 08:24:30 GMT
See <https://builds.apache.org/job/kafka-trunk-jdk8/1986/display/redirect>

------------------------------------------
[...truncated 2.03 MB...]
org.apache.kafka.common.security.ssl.SslFactoryTest > testSslFactoryWithoutPasswordConfiguration
PASSED

org.apache.kafka.common.security.ssl.SslFactoryTest > testClientMode STARTED

org.apache.kafka.common.security.ssl.SslFactoryTest > testClientMode PASSED

org.apache.kafka.common.security.ssl.SslFactoryTest > testSslFactoryConfiguration STARTED

org.apache.kafka.common.security.ssl.SslFactoryTest > testSslFactoryConfiguration PASSED

org.apache.kafka.common.security.kerberos.KerberosNameTest > testParse STARTED

org.apache.kafka.common.security.kerberos.KerberosNameTest > testParse PASSED

org.apache.kafka.common.security.auth.KafkaPrincipalTest > testPrincipalNameCanContainSeparator
STARTED

org.apache.kafka.common.security.auth.KafkaPrincipalTest > testPrincipalNameCanContainSeparator
PASSED

org.apache.kafka.common.security.auth.KafkaPrincipalTest > testEqualsAndHashCode STARTED

org.apache.kafka.common.security.auth.KafkaPrincipalTest > testEqualsAndHashCode PASSED

org.apache.kafka.common.security.JaasContextTest > testLoadForServerWithListenerNameOverride
STARTED

org.apache.kafka.common.security.JaasContextTest > testLoadForServerWithListenerNameOverride
PASSED

org.apache.kafka.common.security.JaasContextTest > testMissingOptionValue STARTED

org.apache.kafka.common.security.JaasContextTest > testMissingOptionValue PASSED

org.apache.kafka.common.security.JaasContextTest > testSingleOption STARTED

org.apache.kafka.common.security.JaasContextTest > testSingleOption PASSED

org.apache.kafka.common.security.JaasContextTest > testNumericOptionWithoutQuotes STARTED

org.apache.kafka.common.security.JaasContextTest > testNumericOptionWithoutQuotes PASSED

org.apache.kafka.common.security.JaasContextTest > testConfigNoOptions STARTED

org.apache.kafka.common.security.JaasContextTest > testConfigNoOptions PASSED

org.apache.kafka.common.security.JaasContextTest > testLoadForServerWithWrongListenerName
STARTED

org.apache.kafka.common.security.JaasContextTest > testLoadForServerWithWrongListenerName
PASSED

org.apache.kafka.common.security.JaasContextTest > testNumericOptionWithQuotes STARTED

org.apache.kafka.common.security.JaasContextTest > testNumericOptionWithQuotes PASSED

org.apache.kafka.common.security.JaasContextTest > testQuotedOptionValue STARTED

org.apache.kafka.common.security.JaasContextTest > testQuotedOptionValue PASSED

org.apache.kafka.common.security.JaasContextTest > testMissingLoginModule STARTED

org.apache.kafka.common.security.JaasContextTest > testMissingLoginModule PASSED

org.apache.kafka.common.security.JaasContextTest > testMissingSemicolon STARTED

org.apache.kafka.common.security.JaasContextTest > testMissingSemicolon PASSED

org.apache.kafka.common.security.JaasContextTest > testMultipleOptions STARTED

org.apache.kafka.common.security.JaasContextTest > testMultipleOptions PASSED

org.apache.kafka.common.security.JaasContextTest > testLoadForClientWithListenerName STARTED

org.apache.kafka.common.security.JaasContextTest > testLoadForClientWithListenerName PASSED

org.apache.kafka.common.security.JaasContextTest > testMultipleLoginModules STARTED

org.apache.kafka.common.security.JaasContextTest > testMultipleLoginModules PASSED

org.apache.kafka.common.security.JaasContextTest > testMissingControlFlag STARTED

org.apache.kafka.common.security.JaasContextTest > testMissingControlFlag PASSED

org.apache.kafka.common.security.JaasContextTest > testLoadForServerWithListenerNameAndFallback
STARTED

org.apache.kafka.common.security.JaasContextTest > testLoadForServerWithListenerNameAndFallback
PASSED

org.apache.kafka.common.security.JaasContextTest > testQuotedOptionName STARTED

org.apache.kafka.common.security.JaasContextTest > testQuotedOptionName PASSED

org.apache.kafka.common.security.JaasContextTest > testControlFlag STARTED

org.apache.kafka.common.security.JaasContextTest > testControlFlag PASSED

org.apache.kafka.common.security.plain.PlainSaslServerTest > noAuthorizationIdSpecified
STARTED

org.apache.kafka.common.security.plain.PlainSaslServerTest > noAuthorizationIdSpecified
PASSED

org.apache.kafka.common.security.plain.PlainSaslServerTest > authorizatonIdEqualsAuthenticationId
STARTED

org.apache.kafka.common.security.plain.PlainSaslServerTest > authorizatonIdEqualsAuthenticationId
PASSED

org.apache.kafka.common.security.plain.PlainSaslServerTest > authorizatonIdNotEqualsAuthenticationId
STARTED

org.apache.kafka.common.security.plain.PlainSaslServerTest > authorizatonIdNotEqualsAuthenticationId
PASSED

org.apache.kafka.common.security.authenticator.SaslAuthenticatorTest > testMissingUsernameSaslPlain
STARTED

org.apache.kafka.common.security.authenticator.SaslAuthenticatorTest > testMissingUsernameSaslPlain
PASSED

org.apache.kafka.common.security.authenticator.SaslAuthenticatorTest > testValidSaslScramMechanisms
STARTED

org.apache.kafka.common.security.authenticator.SaslAuthenticatorTest > testValidSaslScramMechanisms
PASSED

org.apache.kafka.common.security.authenticator.SaslAuthenticatorTest > testUnauthenticatedApiVersionsRequestOverPlaintext
STARTED

org.apache.kafka.common.security.authenticator.SaslAuthenticatorTest > testUnauthenticatedApiVersionsRequestOverPlaintext
PASSED

org.apache.kafka.common.security.authenticator.SaslAuthenticatorTest > testMechanismPluggability
STARTED

org.apache.kafka.common.security.authenticator.SaslAuthenticatorTest > testMechanismPluggability
PASSED

org.apache.kafka.common.security.authenticator.SaslAuthenticatorTest > testScramUsernameWithSpecialCharacters
STARTED

org.apache.kafka.common.security.authenticator.SaslAuthenticatorTest > testScramUsernameWithSpecialCharacters
PASSED

org.apache.kafka.common.security.authenticator.SaslAuthenticatorTest > testApiVersionsRequestWithUnsupportedVersion
STARTED

org.apache.kafka.common.security.authenticator.SaslAuthenticatorTest > testApiVersionsRequestWithUnsupportedVersion
PASSED

org.apache.kafka.common.security.authenticator.SaslAuthenticatorTest > testMissingPasswordSaslPlain
STARTED

org.apache.kafka.common.security.authenticator.SaslAuthenticatorTest > testMissingPasswordSaslPlain
PASSED

org.apache.kafka.common.security.authenticator.SaslAuthenticatorTest > testInvalidLoginModule
STARTED

org.apache.kafka.common.security.authenticator.SaslAuthenticatorTest > testInvalidLoginModule
PASSED

org.apache.kafka.common.security.authenticator.SaslAuthenticatorTest > testValidSaslScramSha256
STARTED

org.apache.kafka.common.security.authenticator.SaslAuthenticatorTest > testValidSaslScramSha256
PASSED

org.apache.kafka.common.security.authenticator.SaslAuthenticatorTest > testInvalidMechanism
STARTED

org.apache.kafka.common.security.authenticator.SaslAuthenticatorTest > testInvalidMechanism
PASSED

org.apache.kafka.common.security.authenticator.SaslAuthenticatorTest > testDisabledMechanism
STARTED

org.apache.kafka.common.security.authenticator.SaslAuthenticatorTest > testDisabledMechanism
PASSED

org.apache.kafka.common.security.authenticator.SaslAuthenticatorTest > testDynamicJaasConfiguration
STARTED

org.apache.kafka.common.security.authenticator.SaslAuthenticatorTest > testDynamicJaasConfiguration
PASSED

org.apache.kafka.common.security.authenticator.SaslAuthenticatorTest > testPacketSizeTooBig
STARTED

org.apache.kafka.common.security.authenticator.SaslAuthenticatorTest > testPacketSizeTooBig
PASSED

org.apache.kafka.common.security.authenticator.SaslAuthenticatorTest > testInvalidUsernameSaslPlain
STARTED

org.apache.kafka.common.security.authenticator.SaslAuthenticatorTest > testInvalidUsernameSaslPlain
PASSED

org.apache.kafka.common.security.authenticator.SaslAuthenticatorTest > testUserCredentialsUnavailableForScramMechanism
STARTED

org.apache.kafka.common.security.authenticator.SaslAuthenticatorTest > testUserCredentialsUnavailableForScramMechanism
PASSED

org.apache.kafka.common.security.authenticator.SaslAuthenticatorTest > testMultipleServerMechanisms
STARTED

org.apache.kafka.common.security.authenticator.SaslAuthenticatorTest > testMultipleServerMechanisms
PASSED

org.apache.kafka.common.security.authenticator.SaslAuthenticatorTest > testValidSaslPlainOverPlaintext
STARTED

org.apache.kafka.common.security.authenticator.SaslAuthenticatorTest > testValidSaslPlainOverPlaintext
PASSED

org.apache.kafka.common.security.authenticator.SaslAuthenticatorTest > testValidSaslPlainOverSsl
STARTED

org.apache.kafka.common.security.authenticator.SaslAuthenticatorTest > testValidSaslPlainOverSsl
PASSED

org.apache.kafka.common.security.authenticator.SaslAuthenticatorTest > testInvalidApiVersionsRequestSequence
STARTED

org.apache.kafka.common.security.authenticator.SaslAuthenticatorTest > testInvalidApiVersionsRequestSequence
PASSED

org.apache.kafka.common.security.authenticator.SaslAuthenticatorTest > testDisallowedKafkaRequestsBeforeAuthentication
STARTED

org.apache.kafka.common.security.authenticator.SaslAuthenticatorTest > testDisallowedKafkaRequestsBeforeAuthentication
PASSED

org.apache.kafka.common.security.authenticator.SaslAuthenticatorTest > testUnauthenticatedApiVersionsRequestOverSsl
STARTED

org.apache.kafka.common.security.authenticator.SaslAuthenticatorTest > testUnauthenticatedApiVersionsRequestOverSsl
PASSED

org.apache.kafka.common.security.authenticator.SaslAuthenticatorTest > testInvalidPasswordSaslPlain
STARTED

org.apache.kafka.common.security.authenticator.SaslAuthenticatorTest > testInvalidPasswordSaslPlain
PASSED

org.apache.kafka.common.security.authenticator.SaslAuthenticatorTest > testInvalidPasswordSaslScram
STARTED

org.apache.kafka.common.security.authenticator.SaslAuthenticatorTest > testInvalidPasswordSaslScram
PASSED

org.apache.kafka.common.security.authenticator.SaslAuthenticatorTest > testInvalidSaslPacket
STARTED

org.apache.kafka.common.security.authenticator.SaslAuthenticatorTest > testInvalidSaslPacket
PASSED

org.apache.kafka.common.security.authenticator.SaslAuthenticatorTest > testSaslHandshakeRequestWithUnsupportedVersion
STARTED

org.apache.kafka.common.security.authenticator.SaslAuthenticatorTest > testSaslHandshakeRequestWithUnsupportedVersion
PASSED

org.apache.kafka.common.security.authenticator.SaslAuthenticatorTest > testJaasConfigurationForListener
STARTED

org.apache.kafka.common.security.authenticator.SaslAuthenticatorTest > testJaasConfigurationForListener
PASSED

org.apache.kafka.common.security.authenticator.SaslAuthenticatorTest > testUnknownUserSaslScram
STARTED

org.apache.kafka.common.security.authenticator.SaslAuthenticatorTest > testUnknownUserSaslScram
PASSED

org.apache.kafka.common.security.authenticator.SaslServerAuthenticatorTest > testUnexpectedRequestType
STARTED

org.apache.kafka.common.security.authenticator.SaslServerAuthenticatorTest > testUnexpectedRequestType
PASSED

org.apache.kafka.common.security.authenticator.SaslServerAuthenticatorTest > testOversizeRequest
STARTED

org.apache.kafka.common.security.authenticator.SaslServerAuthenticatorTest > testOversizeRequest
PASSED

3920 tests completed, 1 failed
:clients:test FAILED

FAILURE: Build failed with an exception.

* What went wrong:
Execution failed for task ':clients:test'.
> There were failing tests. See the report at: file://<https://builds.apache.org/job/kafka-trunk-jdk8/ws/clients/build/reports/tests/test/index.html>

* Try:
Run with --stacktrace option to get the stack trace. Run with --info or --debug option to
get more log output.

* Get more help at https://help.gradle.org

BUILD FAILED in 56m 16s
23 actionable tasks: 19 executed, 4 up-to-date
Build step 'Execute shell' marked build as failure
[FINDBUGS] Collecting findbugs analysis files...
Setting GRADLE_3_4_RC_2_HOME=/home/jenkins/jenkins-slave/tools/hudson.plugins.gradle.GradleInstallation/Gradle_3.4-rc-2
[FINDBUGS] Searching for all files in <https://builds.apache.org/job/kafka-trunk-jdk8/ws/>
that match the pattern **/build/reports/findbugs/*.xml
[FINDBUGS] Parsing 2 files in <https://builds.apache.org/job/kafka-trunk-jdk8/ws/>
[FINDBUGS] Successfully parsed file <https://builds.apache.org/job/kafka-trunk-jdk8/ws/clients/build/reports/findbugs/main.xml>
with 0 unique warnings and 0 duplicates.
[FINDBUGS] Successfully parsed file <https://builds.apache.org/job/kafka-trunk-jdk8/ws/core/build/reports/findbugs/main.xml>
with 0 unique warnings and 0 duplicates.
Setting GRADLE_3_4_RC_2_HOME=/home/jenkins/jenkins-slave/tools/hudson.plugins.gradle.GradleInstallation/Gradle_3.4-rc-2
Setting GRADLE_3_4_RC_2_HOME=/home/jenkins/jenkins-slave/tools/hudson.plugins.gradle.GradleInstallation/Gradle_3.4-rc-2
<Git Blamer> Using GitBlamer to create author and commit information for all warnings.
<Git Blamer> GIT_COMMIT=b041c8d87deab536b262e6260334b5bda1d896c8, workspace=<https://builds.apache.org/job/kafka-trunk-jdk8/ws/>
[FINDBUGS] Computing warning deltas based on reference build #1985
Recording test results
Setting GRADLE_3_4_RC_2_HOME=/home/jenkins/jenkins-slave/tools/hudson.plugins.gradle.GradleInstallation/Gradle_3.4-rc-2
Setting GRADLE_3_4_RC_2_HOME=/home/jenkins/jenkins-slave/tools/hudson.plugins.gradle.GradleInstallation/Gradle_3.4-rc-2

Mime
View raw message