kafka-dev mailing list archives

Site index · List index
Message view « Date » · « Thread »
Top « Date » · « Thread »
From Apache Jenkins Server <jenk...@builds.apache.org>
Subject Build failed in Jenkins: kafka-trunk-jdk7 #2756
Date Wed, 13 Sep 2017 19:02:01 GMT
See <https://builds.apache.org/job/kafka-trunk-jdk7/2756/display/redirect?page=changes>

Changes:

[ismael] KAFKA-4501; Fix EasyMock and disable PowerMock tests under Java 9

------------------------------------------
[...truncated 2.51 MB...]

org.apache.kafka.streams.integration.QueryableStateIntegrationTest > shouldBeAbleToQueryStateWithNonZeroSizedCache
PASSED

org.apache.kafka.streams.integration.KTableKTableJoinIntegrationTest > shouldLeftOuterJoinQueryable
STARTED

org.apache.kafka.streams.integration.KTableKTableJoinIntegrationTest > shouldLeftOuterJoinQueryable
PASSED

org.apache.kafka.streams.integration.KTableKTableJoinIntegrationTest > shouldInnerLeftJoin
STARTED

org.apache.kafka.streams.integration.KTableKTableJoinIntegrationTest > shouldInnerLeftJoin
PASSED

org.apache.kafka.streams.integration.KTableKTableJoinIntegrationTest > shouldOuterOuterJoin
STARTED

org.apache.kafka.streams.integration.KTableKTableJoinIntegrationTest > shouldOuterOuterJoin
PASSED

org.apache.kafka.streams.integration.KTableKTableJoinIntegrationTest > shouldInnerOuterJoin
STARTED

org.apache.kafka.streams.integration.KTableKTableJoinIntegrationTest > shouldInnerOuterJoin
PASSED

org.apache.kafka.streams.integration.KTableKTableJoinIntegrationTest > shouldLeftInnerJoin
STARTED

org.apache.kafka.streams.integration.KTableKTableJoinIntegrationTest > shouldLeftInnerJoin
PASSED

org.apache.kafka.streams.integration.KTableKTableJoinIntegrationTest > shouldInnerInnerJoinQueryable
STARTED

org.apache.kafka.streams.integration.KTableKTableJoinIntegrationTest > shouldInnerInnerJoinQueryable
PASSED

org.apache.kafka.streams.integration.KTableKTableJoinIntegrationTest > shouldInnerOuterJoinQueryable
STARTED

org.apache.kafka.streams.integration.KTableKTableJoinIntegrationTest > shouldInnerOuterJoinQueryable
PASSED

org.apache.kafka.streams.integration.KTableKTableJoinIntegrationTest > shouldOuterLeftJoin
STARTED

org.apache.kafka.streams.integration.KTableKTableJoinIntegrationTest > shouldOuterLeftJoin
PASSED

org.apache.kafka.streams.integration.KTableKTableJoinIntegrationTest > shouldOuterInnerJoin
STARTED

org.apache.kafka.streams.integration.KTableKTableJoinIntegrationTest > shouldOuterInnerJoin
PASSED

org.apache.kafka.streams.integration.KTableKTableJoinIntegrationTest > shouldInnerInnerJoin
STARTED

org.apache.kafka.streams.integration.KTableKTableJoinIntegrationTest > shouldInnerInnerJoin
PASSED

org.apache.kafka.streams.integration.KTableKTableJoinIntegrationTest > shouldLeftOuterJoin
STARTED

org.apache.kafka.streams.integration.KTableKTableJoinIntegrationTest > shouldLeftOuterJoin
PASSED

org.apache.kafka.streams.integration.KTableKTableJoinIntegrationTest > shouldOuterLeftJoinQueryable
STARTED

org.apache.kafka.streams.integration.KTableKTableJoinIntegrationTest > shouldOuterLeftJoinQueryable
PASSED

org.apache.kafka.streams.integration.KTableKTableJoinIntegrationTest > shouldLeftLeftJoin
STARTED

org.apache.kafka.streams.integration.KTableKTableJoinIntegrationTest > shouldLeftLeftJoin
PASSED

org.apache.kafka.streams.integration.KTableKTableJoinIntegrationTest > shouldOuterInnerJoinQueryable
STARTED

org.apache.kafka.streams.integration.KTableKTableJoinIntegrationTest > shouldOuterInnerJoinQueryable
PASSED

org.apache.kafka.streams.integration.KTableKTableJoinIntegrationTest > shouldLeftInnerJoinQueryable
STARTED

org.apache.kafka.streams.integration.KTableKTableJoinIntegrationTest > shouldLeftInnerJoinQueryable
PASSED

org.apache.kafka.streams.integration.KTableKTableJoinIntegrationTest > shouldInnerLeftJoinQueryable
STARTED

org.apache.kafka.streams.integration.KTableKTableJoinIntegrationTest > shouldInnerLeftJoinQueryable
PASSED

org.apache.kafka.streams.integration.KTableKTableJoinIntegrationTest > shouldLeftLeftJoinQueryable
STARTED

org.apache.kafka.streams.integration.KTableKTableJoinIntegrationTest > shouldLeftLeftJoinQueryable
PASSED

org.apache.kafka.streams.integration.KTableKTableJoinIntegrationTest > shouldOuterOuterJoinQueryable
STARTED

org.apache.kafka.streams.integration.KTableKTableJoinIntegrationTest > shouldOuterOuterJoinQueryable
PASSED

org.apache.kafka.streams.integration.GlobalKTableIntegrationTest > shouldKStreamGlobalKTableLeftJoin
STARTED

org.apache.kafka.streams.integration.GlobalKTableIntegrationTest > shouldKStreamGlobalKTableLeftJoin
PASSED

org.apache.kafka.streams.integration.GlobalKTableIntegrationTest > shouldKStreamGlobalKTableJoin
STARTED

org.apache.kafka.streams.integration.GlobalKTableIntegrationTest > shouldKStreamGlobalKTableJoin
PASSED

org.apache.kafka.streams.integration.FanoutIntegrationTest > shouldFanoutTheInput STARTED

org.apache.kafka.streams.integration.FanoutIntegrationTest > shouldFanoutTheInput PASSED

org.apache.kafka.streams.integration.EosIntegrationTest > shouldBeAbleToRunWithEosEnabled
STARTED

org.apache.kafka.streams.integration.EosIntegrationTest > shouldBeAbleToRunWithEosEnabled
PASSED

org.apache.kafka.streams.integration.EosIntegrationTest > shouldBeAbleToCommitToMultiplePartitions
STARTED

org.apache.kafka.streams.integration.EosIntegrationTest > shouldBeAbleToCommitToMultiplePartitions
PASSED

org.apache.kafka.streams.integration.EosIntegrationTest > shouldNotViolateEosIfOneTaskFails
STARTED

org.apache.kafka.streams.integration.EosIntegrationTest > shouldNotViolateEosIfOneTaskFails
PASSED

org.apache.kafka.streams.integration.EosIntegrationTest > shouldBeAbleToPerformMultipleTransactions
STARTED

org.apache.kafka.streams.integration.EosIntegrationTest > shouldBeAbleToPerformMultipleTransactions
PASSED

org.apache.kafka.streams.integration.EosIntegrationTest > shouldBeAbleToCommitMultiplePartitionOffsets
STARTED

org.apache.kafka.streams.integration.EosIntegrationTest > shouldBeAbleToCommitMultiplePartitionOffsets
PASSED

org.apache.kafka.streams.integration.EosIntegrationTest > shouldBeAbleToRunWithTwoSubtopologies
STARTED

org.apache.kafka.streams.integration.EosIntegrationTest > shouldBeAbleToRunWithTwoSubtopologies
PASSED

org.apache.kafka.streams.integration.EosIntegrationTest > shouldNotViolateEosIfOneTaskGetsFencedUsingIsolatedAppInstances
STARTED

org.apache.kafka.streams.integration.EosIntegrationTest > shouldNotViolateEosIfOneTaskGetsFencedUsingIsolatedAppInstances
PASSED

org.apache.kafka.streams.integration.EosIntegrationTest > shouldNotViolateEosIfOneTaskFailsWithState
STARTED

org.apache.kafka.streams.integration.EosIntegrationTest > shouldNotViolateEosIfOneTaskFailsWithState
PASSED

org.apache.kafka.streams.integration.EosIntegrationTest > shouldBeAbleToRunWithTwoSubtopologiesAndMultiplePartitions
STARTED

org.apache.kafka.streams.integration.EosIntegrationTest > shouldBeAbleToRunWithTwoSubtopologiesAndMultiplePartitions
PASSED

org.apache.kafka.streams.integration.EosIntegrationTest > shouldBeAbleToRestartAfterClose
STARTED

org.apache.kafka.streams.integration.EosIntegrationTest > shouldBeAbleToRestartAfterClose
PASSED

org.apache.kafka.streams.integration.KStreamRepartitionJoinTest > shouldCorrectlyRepartitionOnJoinOperationsWithZeroSizedCache
STARTED

org.apache.kafka.streams.integration.KStreamRepartitionJoinTest > shouldCorrectlyRepartitionOnJoinOperationsWithZeroSizedCache
PASSED

org.apache.kafka.streams.integration.KStreamRepartitionJoinTest > shouldCorrectlyRepartitionOnJoinOperationsWithNonZeroSizedCache
STARTED

org.apache.kafka.streams.integration.KStreamRepartitionJoinTest > shouldCorrectlyRepartitionOnJoinOperationsWithNonZeroSizedCache
PASSED

org.apache.kafka.streams.integration.KStreamKTableJoinIntegrationTest > shouldCountClicksPerRegionWithZeroByteCache
STARTED

org.apache.kafka.streams.integration.KStreamKTableJoinIntegrationTest > shouldCountClicksPerRegionWithZeroByteCache
PASSED

org.apache.kafka.streams.integration.KStreamKTableJoinIntegrationTest > shouldCountClicksPerRegionWithNonZeroByteCache
STARTED

org.apache.kafka.streams.integration.KStreamKTableJoinIntegrationTest > shouldCountClicksPerRegionWithNonZeroByteCache
PASSED

org.apache.kafka.streams.integration.InternalTopicIntegrationTest > shouldCompactTopicsForStateChangelogs
STARTED

org.apache.kafka.streams.integration.InternalTopicIntegrationTest > shouldCompactTopicsForStateChangelogs
PASSED

org.apache.kafka.streams.integration.InternalTopicIntegrationTest > shouldUseCompactAndDeleteForWindowStoreChangelogs
STARTED

org.apache.kafka.streams.integration.InternalTopicIntegrationTest > shouldUseCompactAndDeleteForWindowStoreChangelogs
PASSED

org.apache.kafka.streams.integration.KStreamAggregationIntegrationTest > shouldReduceSessionWindows
STARTED

org.apache.kafka.streams.integration.KStreamAggregationIntegrationTest > shouldReduceSessionWindows
PASSED

org.apache.kafka.streams.integration.KStreamAggregationIntegrationTest > shouldReduce STARTED

org.apache.kafka.streams.integration.KStreamAggregationIntegrationTest > shouldReduce PASSED

org.apache.kafka.streams.integration.KStreamAggregationIntegrationTest > shouldAggregate
STARTED

org.apache.kafka.streams.integration.KStreamAggregationIntegrationTest > shouldAggregate
PASSED

org.apache.kafka.streams.integration.KStreamAggregationIntegrationTest > shouldCount STARTED

org.apache.kafka.streams.integration.KStreamAggregationIntegrationTest > shouldCount PASSED

org.apache.kafka.streams.integration.KStreamAggregationIntegrationTest > shouldGroupByKey
STARTED

org.apache.kafka.streams.integration.KStreamAggregationIntegrationTest > shouldGroupByKey
PASSED

org.apache.kafka.streams.integration.KStreamAggregationIntegrationTest > shouldCountWithInternalStore
STARTED

org.apache.kafka.streams.integration.KStreamAggregationIntegrationTest > shouldCountWithInternalStore
PASSED

org.apache.kafka.streams.integration.KStreamAggregationIntegrationTest > shouldReduceWindowed
STARTED

org.apache.kafka.streams.integration.KStreamAggregationIntegrationTest > shouldReduceWindowed
PASSED

org.apache.kafka.streams.integration.KStreamAggregationIntegrationTest > shouldCountSessionWindows
STARTED

org.apache.kafka.streams.integration.KStreamAggregationIntegrationTest > shouldCountSessionWindows
PASSED

org.apache.kafka.streams.integration.KStreamAggregationIntegrationTest > shouldAggregateWindowed
STARTED

org.apache.kafka.streams.integration.KStreamAggregationIntegrationTest > shouldAggregateWindowed
PASSED

org.apache.kafka.streams.integration.KStreamsFineGrainedAutoResetIntegrationTest > shouldOnlyReadRecordsWhereEarliestSpecifiedWithNoCommittedOffsetsWithGlobalAutoOffsetResetLatest
STARTED

org.apache.kafka.streams.integration.KStreamsFineGrainedAutoResetIntegrationTest > shouldOnlyReadRecordsWhereEarliestSpecifiedWithNoCommittedOffsetsWithGlobalAutoOffsetResetLatest
PASSED

org.apache.kafka.streams.integration.KStreamsFineGrainedAutoResetIntegrationTest > shouldThrowExceptionOverlappingPattern
STARTED

org.apache.kafka.streams.integration.KStreamsFineGrainedAutoResetIntegrationTest > shouldThrowExceptionOverlappingPattern
PASSED

org.apache.kafka.streams.integration.KStreamsFineGrainedAutoResetIntegrationTest > shouldThrowExceptionOverlappingTopic
STARTED

org.apache.kafka.streams.integration.KStreamsFineGrainedAutoResetIntegrationTest > shouldThrowExceptionOverlappingTopic
PASSED

org.apache.kafka.streams.integration.KStreamsFineGrainedAutoResetIntegrationTest > shouldOnlyReadRecordsWhereEarliestSpecifiedWithInvalidCommittedOffsets
STARTED

org.apache.kafka.streams.integration.KStreamsFineGrainedAutoResetIntegrationTest > shouldOnlyReadRecordsWhereEarliestSpecifiedWithInvalidCommittedOffsets
PASSED

org.apache.kafka.streams.integration.KStreamsFineGrainedAutoResetIntegrationTest > shouldOnlyReadRecordsWhereEarliestSpecifiedWithNoCommittedOffsetsWithDefaultGlobalAutoOffsetResetEarliest
STARTED

org.apache.kafka.streams.integration.KStreamsFineGrainedAutoResetIntegrationTest > shouldOnlyReadRecordsWhereEarliestSpecifiedWithNoCommittedOffsetsWithDefaultGlobalAutoOffsetResetEarliest
PASSED

org.apache.kafka.streams.integration.KStreamsFineGrainedAutoResetIntegrationTest > shouldThrowStreamsExceptionNoResetSpecified
STARTED

org.apache.kafka.streams.integration.KStreamsFineGrainedAutoResetIntegrationTest > shouldThrowStreamsExceptionNoResetSpecified
PASSED

1683 tests completed, 2 failed
:streams:test FAILED

FAILURE: Build failed with an exception.

* What went wrong:
Execution failed for task ':streams:test'.
> There were failing tests. See the report at: file://<https://builds.apache.org/job/kafka-trunk-jdk7/ws/streams/build/reports/tests/test/index.html>

* Try:
Run with --stacktrace option to get the stack trace. Run with --info or --debug option to
get more log output.

* Get more help at https://help.gradle.org

BUILD FAILED in 1h 22m 54s
52 actionable tasks: 37 executed, 15 up-to-date
Build step 'Execute shell' marked build as failure
[FINDBUGS] Collecting findbugs analysis files...
Setting GRADLE_3_4_RC_2_HOME=/home/jenkins/jenkins-slave/tools/hudson.plugins.gradle.GradleInstallation/Gradle_3.4-rc-2
[FINDBUGS] Searching for all files in <https://builds.apache.org/job/kafka-trunk-jdk7/ws/>
that match the pattern **/build/reports/findbugs/*.xml
[FINDBUGS] Parsing 5 files in <https://builds.apache.org/job/kafka-trunk-jdk7/ws/>
[FINDBUGS] Successfully parsed file <https://builds.apache.org/job/kafka-trunk-jdk7/ws/clients/build/reports/findbugs/main.xml>
with 0 unique warnings and 0 duplicates.
[FINDBUGS] Successfully parsed file <https://builds.apache.org/job/kafka-trunk-jdk7/ws/core/build/reports/findbugs/main.xml>
with 0 unique warnings and 0 duplicates.
[FINDBUGS] Successfully parsed file <https://builds.apache.org/job/kafka-trunk-jdk7/ws/examples/build/reports/findbugs/main.xml>
with 0 unique warnings and 0 duplicates.
[FINDBUGS] Successfully parsed file <https://builds.apache.org/job/kafka-trunk-jdk7/ws/log4j-appender/build/reports/findbugs/main.xml>
with 0 unique warnings and 0 duplicates.
[FINDBUGS] Successfully parsed file <https://builds.apache.org/job/kafka-trunk-jdk7/ws/streams/build/reports/findbugs/main.xml>
with 0 unique warnings and 0 duplicates.
Setting GRADLE_3_4_RC_2_HOME=/home/jenkins/jenkins-slave/tools/hudson.plugins.gradle.GradleInstallation/Gradle_3.4-rc-2
Setting GRADLE_3_4_RC_2_HOME=/home/jenkins/jenkins-slave/tools/hudson.plugins.gradle.GradleInstallation/Gradle_3.4-rc-2
<Git Blamer> Using GitBlamer to create author and commit information for all warnings.
<Git Blamer> GIT_COMMIT=ffd8f18a129fa826d62f527ea2c8eba2cfd644b2, workspace=<https://builds.apache.org/job/kafka-trunk-jdk7/ws/>
[FINDBUGS] Computing warning deltas based on reference build #2741
Recording test results
Setting GRADLE_3_4_RC_2_HOME=/home/jenkins/jenkins-slave/tools/hudson.plugins.gradle.GradleInstallation/Gradle_3.4-rc-2
Setting GRADLE_3_4_RC_2_HOME=/home/jenkins/jenkins-slave/tools/hudson.plugins.gradle.GradleInstallation/Gradle_3.4-rc-2
Not sending mail to unregistered user damian.guy@gmail.com
Not sending mail to unregistered user wangguoz@gmail.com
Not sending mail to unregistered user rajinisivaram@googlemail.com
Not sending mail to unregistered user ismael@juma.me.uk

Mime
View raw message