kafka-dev mailing list archives

Site index · List index
Message view « Date » · « Thread »
Top « Date » · « Thread »
From Apache Jenkins Server <jenk...@builds.apache.org>
Subject Build failed in Jenkins: kafka-trunk-jdk8 #1927
Date Mon, 21 Aug 2017 18:33:21 GMT
See <https://builds.apache.org/job/kafka-trunk-jdk8/1927/display/redirect?page=changes>

Changes:

[jason] KAFKA-5747; Producer snapshot loading should cover schema errors

[ismael] KAFKA-5743; Ducktape services should use subdirs of /mnt

------------------------------------------
[...truncated 923.10 KB...]

kafka.integration.AutoOffsetResetTest > testResetToEarliestWhenOffsetTooLow STARTED

kafka.integration.AutoOffsetResetTest > testResetToEarliestWhenOffsetTooLow PASSED

kafka.integration.AutoOffsetResetTest > testResetToEarliestWhenOffsetTooHigh STARTED

kafka.integration.AutoOffsetResetTest > testResetToEarliestWhenOffsetTooHigh PASSED

kafka.integration.AutoOffsetResetTest > testResetToLatestWhenOffsetTooHigh STARTED

kafka.integration.AutoOffsetResetTest > testResetToLatestWhenOffsetTooHigh PASSED

kafka.integration.TopicMetadataTest > testIsrAfterBrokerShutDownAndJoinsBack STARTED

kafka.integration.TopicMetadataTest > testIsrAfterBrokerShutDownAndJoinsBack PASSED

kafka.integration.TopicMetadataTest > testAutoCreateTopicWithCollision STARTED

kafka.integration.TopicMetadataTest > testAutoCreateTopicWithCollision PASSED

kafka.integration.TopicMetadataTest > testAliveBrokerListWithNoTopics STARTED

kafka.integration.TopicMetadataTest > testAliveBrokerListWithNoTopics PASSED

kafka.integration.TopicMetadataTest > testAutoCreateTopic STARTED

kafka.integration.TopicMetadataTest > testAutoCreateTopic PASSED

kafka.integration.TopicMetadataTest > testGetAllTopicMetadata STARTED

kafka.integration.TopicMetadataTest > testGetAllTopicMetadata PASSED

kafka.integration.TopicMetadataTest > testAliveBrokersListWithNoTopicsAfterNewBrokerStartup
STARTED

kafka.integration.TopicMetadataTest > testAliveBrokersListWithNoTopicsAfterNewBrokerStartup
PASSED

kafka.integration.TopicMetadataTest > testBasicTopicMetadata STARTED

kafka.integration.TopicMetadataTest > testBasicTopicMetadata PASSED

kafka.integration.TopicMetadataTest > testAutoCreateTopicWithInvalidReplication STARTED

kafka.integration.TopicMetadataTest > testAutoCreateTopicWithInvalidReplication PASSED

kafka.integration.TopicMetadataTest > testAliveBrokersListWithNoTopicsAfterABrokerShutdown
STARTED

kafka.integration.TopicMetadataTest > testAliveBrokersListWithNoTopicsAfterABrokerShutdown
PASSED

kafka.integration.FetcherTest > testFetcher STARTED

kafka.integration.FetcherTest > testFetcher PASSED

kafka.integration.UncleanLeaderElectionTest > testUncleanLeaderElectionEnabled STARTED

kafka.integration.UncleanLeaderElectionTest > testUncleanLeaderElectionEnabled PASSED

kafka.integration.UncleanLeaderElectionTest > testCleanLeaderElectionDisabledByTopicOverride
STARTED

kafka.integration.UncleanLeaderElectionTest > testCleanLeaderElectionDisabledByTopicOverride
SKIPPED

kafka.integration.UncleanLeaderElectionTest > testUncleanLeaderElectionDisabled STARTED

kafka.integration.UncleanLeaderElectionTest > testUncleanLeaderElectionDisabled SKIPPED

kafka.integration.UncleanLeaderElectionTest > testUncleanLeaderElectionInvalidTopicOverride
STARTED

kafka.integration.UncleanLeaderElectionTest > testUncleanLeaderElectionInvalidTopicOverride
PASSED

kafka.integration.UncleanLeaderElectionTest > testUncleanLeaderElectionEnabledByTopicOverride
STARTED

kafka.integration.UncleanLeaderElectionTest > testUncleanLeaderElectionEnabledByTopicOverride
PASSED

kafka.integration.MinIsrConfigTest > testDefaultKafkaConfig STARTED

kafka.integration.MinIsrConfigTest > testDefaultKafkaConfig PASSED

unit.kafka.server.KafkaApisTest > shouldRespondWithUnsupportedForMessageFormatOnHandleWriteTxnMarkersWhenMagicLowerThanRequired
STARTED

unit.kafka.server.KafkaApisTest > shouldRespondWithUnsupportedForMessageFormatOnHandleWriteTxnMarkersWhenMagicLowerThanRequired
PASSED

unit.kafka.server.KafkaApisTest > shouldThrowUnsupportedVersionExceptionOnHandleTxnOffsetCommitRequestWhenInterBrokerProtocolNotSupported
STARTED

unit.kafka.server.KafkaApisTest > shouldThrowUnsupportedVersionExceptionOnHandleTxnOffsetCommitRequestWhenInterBrokerProtocolNotSupported
PASSED

unit.kafka.server.KafkaApisTest > shouldThrowUnsupportedVersionExceptionOnHandleAddPartitionsToTxnRequestWhenInterBrokerProtocolNotSupported
STARTED

unit.kafka.server.KafkaApisTest > shouldThrowUnsupportedVersionExceptionOnHandleAddPartitionsToTxnRequestWhenInterBrokerProtocolNotSupported
PASSED

unit.kafka.server.KafkaApisTest > testReadUncommittedConsumerListOffsetLatest STARTED

unit.kafka.server.KafkaApisTest > testReadUncommittedConsumerListOffsetLatest PASSED

unit.kafka.server.KafkaApisTest > shouldAppendToLogOnWriteTxnMarkersWhenCorrectMagicVersion
STARTED

unit.kafka.server.KafkaApisTest > shouldAppendToLogOnWriteTxnMarkersWhenCorrectMagicVersion
PASSED

unit.kafka.server.KafkaApisTest > shouldThrowUnsupportedVersionExceptionOnHandleWriteTxnMarkersRequestWhenInterBrokerProtocolNotSupported
STARTED

unit.kafka.server.KafkaApisTest > shouldThrowUnsupportedVersionExceptionOnHandleWriteTxnMarkersRequestWhenInterBrokerProtocolNotSupported
PASSED

unit.kafka.server.KafkaApisTest > shouldRespondWithUnknownTopicWhenPartitionIsNotHosted
STARTED

unit.kafka.server.KafkaApisTest > shouldRespondWithUnknownTopicWhenPartitionIsNotHosted
PASSED

unit.kafka.server.KafkaApisTest > testReadCommittedConsumerListOffsetEarliestOffsetEqualsLastStableOffset
STARTED

unit.kafka.server.KafkaApisTest > testReadCommittedConsumerListOffsetEarliestOffsetEqualsLastStableOffset
PASSED

unit.kafka.server.KafkaApisTest > testReadCommittedConsumerListOffsetLatest STARTED

unit.kafka.server.KafkaApisTest > testReadCommittedConsumerListOffsetLatest PASSED

unit.kafka.server.KafkaApisTest > testReadCommittedConsumerListOffsetLimitedAtLastStableOffset
STARTED

unit.kafka.server.KafkaApisTest > testReadCommittedConsumerListOffsetLimitedAtLastStableOffset
PASSED

unit.kafka.server.KafkaApisTest > testReadUncommittedConsumerListOffsetEarliestOffsetEqualsHighWatermark
STARTED

unit.kafka.server.KafkaApisTest > testReadUncommittedConsumerListOffsetEarliestOffsetEqualsHighWatermark
PASSED

unit.kafka.server.KafkaApisTest > testReadUncommittedConsumerListOffsetLimitedAtHighWatermark
STARTED

unit.kafka.server.KafkaApisTest > testReadUncommittedConsumerListOffsetLimitedAtHighWatermark
PASSED

unit.kafka.server.KafkaApisTest > shouldThrowUnsupportedVersionExceptionOnHandleAddOffsetToTxnRequestWhenInterBrokerProtocolNotSupported
STARTED

unit.kafka.server.KafkaApisTest > shouldThrowUnsupportedVersionExceptionOnHandleAddOffsetToTxnRequestWhenInterBrokerProtocolNotSupported
PASSED

unit.kafka.server.KafkaApisTest > shouldRespondWithUnsupportedMessageFormatForBadPartitionAndNoErrorsForGoodPartition
STARTED

unit.kafka.server.KafkaApisTest > shouldRespondWithUnsupportedMessageFormatForBadPartitionAndNoErrorsForGoodPartition
PASSED

unit.kafka.server.KafkaApisTest > shouldThrowUnsupportedVersionExceptionOnHandleEndTxnRequestWhenInterBrokerProtocolNotSupported
STARTED

unit.kafka.server.KafkaApisTest > shouldThrowUnsupportedVersionExceptionOnHandleEndTxnRequestWhenInterBrokerProtocolNotSupported
PASSED

unit.kafka.server.KafkaApisTest > shouldRespondWithUnknownTopicOrPartitionForBadPartitionAndNoErrorsForGoodPartition
STARTED

unit.kafka.server.KafkaApisTest > shouldRespondWithUnknownTopicOrPartitionForBadPartitionAndNoErrorsForGoodPartition
PASSED

unit.kafka.admin.ResetConsumerGroupOffsetTest > testResetOffsetsShiftByHigherThanLatest
STARTED

unit.kafka.admin.ResetConsumerGroupOffsetTest > testResetOffsetsShiftByHigherThanLatest
PASSED

unit.kafka.admin.ResetConsumerGroupOffsetTest > testResetOffsetsShiftMinus STARTED

unit.kafka.admin.ResetConsumerGroupOffsetTest > testResetOffsetsShiftMinus PASSED

unit.kafka.admin.ResetConsumerGroupOffsetTest > testResetOffsetsToCurrentOffset STARTED

unit.kafka.admin.ResetConsumerGroupOffsetTest > testResetOffsetsToCurrentOffset PASSED

unit.kafka.admin.ResetConsumerGroupOffsetTest > testResetOffsetsToEarliestOnOneTopicAndPartition
STARTED

unit.kafka.admin.ResetConsumerGroupOffsetTest > testResetOffsetsToEarliestOnOneTopicAndPartition
PASSED

unit.kafka.admin.ResetConsumerGroupOffsetTest > testResetOffsetsByDurationToEarliest STARTED

unit.kafka.admin.ResetConsumerGroupOffsetTest > testResetOffsetsByDurationToEarliest PASSED

unit.kafka.admin.ResetConsumerGroupOffsetTest > testResetOffsetsToEarliestOnOneTopic STARTED

unit.kafka.admin.ResetConsumerGroupOffsetTest > testResetOffsetsToEarliestOnOneTopic PASSED

unit.kafka.admin.ResetConsumerGroupOffsetTest > testResetOffsetsNotExistingGroup STARTED

unit.kafka.admin.ResetConsumerGroupOffsetTest > testResetOffsetsNotExistingGroup PASSED

unit.kafka.admin.ResetConsumerGroupOffsetTest > testResetOffsetsToZonedDateTime STARTED

unit.kafka.admin.ResetConsumerGroupOffsetTest > testResetOffsetsToZonedDateTime PASSED

unit.kafka.admin.ResetConsumerGroupOffsetTest > testResetOffsetsToEarliest STARTED

unit.kafka.admin.ResetConsumerGroupOffsetTest > testResetOffsetsToEarliest PASSED

unit.kafka.admin.ResetConsumerGroupOffsetTest > testResetOffsetsExportImportPlan STARTED

unit.kafka.admin.ResetConsumerGroupOffsetTest > testResetOffsetsExportImportPlan PASSED

unit.kafka.admin.ResetConsumerGroupOffsetTest > testResetOffsetsToSpecificOffset STARTED

unit.kafka.admin.ResetConsumerGroupOffsetTest > testResetOffsetsToSpecificOffset PASSED

unit.kafka.admin.ResetConsumerGroupOffsetTest > testResetOffsetsShiftPlus STARTED

unit.kafka.admin.ResetConsumerGroupOffsetTest > testResetOffsetsShiftPlus PASSED

unit.kafka.admin.ResetConsumerGroupOffsetTest > testResetOffsetsToLatest STARTED

unit.kafka.admin.ResetConsumerGroupOffsetTest > testResetOffsetsToLatest PASSED

unit.kafka.admin.ResetConsumerGroupOffsetTest > testResetOffsetsNewConsumerExistingTopic
STARTED

unit.kafka.admin.ResetConsumerGroupOffsetTest > testResetOffsetsNewConsumerExistingTopic
PASSED

unit.kafka.admin.ResetConsumerGroupOffsetTest > testResetOffsetsShiftByLowerThanEarliest
STARTED

unit.kafka.admin.ResetConsumerGroupOffsetTest > testResetOffsetsShiftByLowerThanEarliest
PASSED

unit.kafka.admin.ResetConsumerGroupOffsetTest > testResetOffsetsByDuration STARTED

unit.kafka.admin.ResetConsumerGroupOffsetTest > testResetOffsetsByDuration PASSED

unit.kafka.admin.ResetConsumerGroupOffsetTest > testResetOffsetsToLocalDateTime STARTED

unit.kafka.admin.ResetConsumerGroupOffsetTest > testResetOffsetsToLocalDateTime PASSED

unit.kafka.admin.ResetConsumerGroupOffsetTest > testResetOffsetsToEarliestOnTopicsAndPartitions
STARTED

unit.kafka.admin.ResetConsumerGroupOffsetTest > testResetOffsetsToEarliestOnTopicsAndPartitions
PASSED

unit.kafka.admin.ResetConsumerGroupOffsetTest > testResetOffsetsToEarliestOnTopics STARTED

unit.kafka.admin.ResetConsumerGroupOffsetTest > testResetOffsetsToEarliestOnTopics PASSED

1549 tests completed, 2 failed, 4 skipped
:kafka-trunk-jdk8:core:test FAILED
:test_core_2_11 FAILED

FAILURE: Build failed with an exception.

* What went wrong:
Execution failed for task ':kafka-trunk-jdk8:core:test'.
> There were failing tests. See the report at: file://<https://builds.apache.org/job/kafka-trunk-jdk8/ws/core/build/reports/tests/test/index.html>

* Try:
Run with --stacktrace option to get the stack trace. Run with --info or --debug option to
get more log output.

* Get more help at https://help.gradle.org

BUILD FAILED in 51m 8s
16 actionable tasks: 3 executed, 13 up-to-date
Build step 'Execute shell' marked build as failure
[FINDBUGS] Collecting findbugs analysis files...
Setting GRADLE_3_4_RC_2_HOME=/home/jenkins/jenkins-slave/tools/hudson.plugins.gradle.GradleInstallation/Gradle_3.4-rc-2
[FINDBUGS] Searching for all files in <https://builds.apache.org/job/kafka-trunk-jdk8/ws/>
that match the pattern **/build/reports/findbugs/*.xml
[FINDBUGS] Parsing 1 file in <https://builds.apache.org/job/kafka-trunk-jdk8/ws/>
[FINDBUGS] Successfully parsed file <https://builds.apache.org/job/kafka-trunk-jdk8/ws/core/build/reports/findbugs/main.xml>
with 0 unique warnings and 0 duplicates.
Setting GRADLE_3_4_RC_2_HOME=/home/jenkins/jenkins-slave/tools/hudson.plugins.gradle.GradleInstallation/Gradle_3.4-rc-2
Setting GRADLE_3_4_RC_2_HOME=/home/jenkins/jenkins-slave/tools/hudson.plugins.gradle.GradleInstallation/Gradle_3.4-rc-2
<Git Blamer> Using GitBlamer to create author and commit information for all warnings.
<Git Blamer> GIT_COMMIT=57dbe39ae1e8312c5e0e6603061d2816a8c05198, workspace=<https://builds.apache.org/job/kafka-trunk-jdk8/ws/>
[FINDBUGS] Computing warning deltas based on reference build #1925
Recording test results
Setting GRADLE_3_4_RC_2_HOME=/home/jenkins/jenkins-slave/tools/hudson.plugins.gradle.GradleInstallation/Gradle_3.4-rc-2
Setting GRADLE_3_4_RC_2_HOME=/home/jenkins/jenkins-slave/tools/hudson.plugins.gradle.GradleInstallation/Gradle_3.4-rc-2
Not sending mail to unregistered user ismael@juma.me.uk

Mime
View raw message