kafka-dev mailing list archives

Site index · List index
Message view « Date » · « Thread »
Top « Date » · « Thread »
From Apache Jenkins Server <jenk...@builds.apache.org>
Subject Build failed in Jenkins: kafka-trunk-jdk7 #2524
Date Tue, 18 Jul 2017 01:38:08 GMT
See <https://builds.apache.org/job/kafka-trunk-jdk7/2524/display/redirect?page=changes>

Changes:

[ismael] KAFKA-5587; Remove channel only after staged receives are delivered

------------------------------------------
[...truncated 2.08 MB...]
org.apache.kafka.clients.producer.internals.RecordAccumulatorTest > testStressfulSituation
STARTED

org.apache.kafka.clients.producer.internals.RecordAccumulatorTest > testStressfulSituation
PASSED

org.apache.kafka.clients.producer.internals.RecordAccumulatorTest > testAppendLargeNonCompressed
STARTED

org.apache.kafka.clients.producer.internals.RecordAccumulatorTest > testAppendLargeNonCompressed
PASSED

org.apache.kafka.clients.producer.internals.RecordAccumulatorTest > testAwaitFlushComplete
STARTED

org.apache.kafka.clients.producer.internals.RecordAccumulatorTest > testAwaitFlushComplete
PASSED

org.apache.kafka.clients.producer.internals.RecordAccumulatorTest > testFlush STARTED

org.apache.kafka.clients.producer.internals.RecordAccumulatorTest > testFlush PASSED

org.apache.kafka.clients.producer.internals.RecordAccumulatorTest > testFull STARTED

org.apache.kafka.clients.producer.internals.RecordAccumulatorTest > testFull PASSED

org.apache.kafka.clients.producer.internals.RecordAccumulatorTest > testSplitFrequency
STARTED

org.apache.kafka.clients.producer.internals.RecordAccumulatorTest > testSplitFrequency
PASSED

org.apache.kafka.clients.producer.internals.RecordAccumulatorTest > testAbortUnsentBatches
STARTED

org.apache.kafka.clients.producer.internals.RecordAccumulatorTest > testAbortUnsentBatches
PASSED

org.apache.kafka.clients.producer.internals.RecordAccumulatorTest > testIdempotenceWithOldMagic
STARTED

org.apache.kafka.clients.producer.internals.RecordAccumulatorTest > testIdempotenceWithOldMagic
PASSED

org.apache.kafka.clients.producer.internals.RecordAccumulatorTest > testAppendLargeOldMessageFormatNonCompressed
STARTED

org.apache.kafka.clients.producer.internals.RecordAccumulatorTest > testAppendLargeOldMessageFormatNonCompressed
PASSED

org.apache.kafka.clients.producer.internals.RecordAccumulatorTest > testAbortIncompleteBatches
STARTED

org.apache.kafka.clients.producer.internals.RecordAccumulatorTest > testAbortIncompleteBatches
PASSED

org.apache.kafka.clients.producer.internals.RecordAccumulatorTest > testAppendLargeCompressed
STARTED

org.apache.kafka.clients.producer.internals.RecordAccumulatorTest > testAppendLargeCompressed
PASSED

org.apache.kafka.clients.producer.internals.RecordAccumulatorTest > testMutedPartitions
STARTED

org.apache.kafka.clients.producer.internals.RecordAccumulatorTest > testMutedPartitions
PASSED

org.apache.kafka.clients.producer.internals.RecordAccumulatorTest > testExpiredBatches
STARTED

org.apache.kafka.clients.producer.internals.RecordAccumulatorTest > testExpiredBatches
PASSED

org.apache.kafka.clients.producer.internals.RecordAccumulatorTest > testAppendLargeOldMessageFormatCompressed
STARTED

org.apache.kafka.clients.producer.internals.RecordAccumulatorTest > testAppendLargeOldMessageFormatCompressed
PASSED

org.apache.kafka.clients.producer.internals.RecordAccumulatorTest > testLinger STARTED

org.apache.kafka.clients.producer.internals.RecordAccumulatorTest > testLinger PASSED

org.apache.kafka.clients.producer.internals.RecordAccumulatorTest > testPartialDrain STARTED

org.apache.kafka.clients.producer.internals.RecordAccumulatorTest > testPartialDrain PASSED

org.apache.kafka.clients.producer.internals.RecordAccumulatorTest > testSplitAndReenqueue
STARTED

org.apache.kafka.clients.producer.internals.RecordAccumulatorTest > testSplitAndReenqueue
PASSED

org.apache.kafka.clients.producer.internals.BufferPoolTest > testSimple STARTED

org.apache.kafka.clients.producer.internals.BufferPoolTest > testSimple PASSED

org.apache.kafka.clients.producer.internals.BufferPoolTest > testStressfulSituation STARTED

org.apache.kafka.clients.producer.internals.BufferPoolTest > testStressfulSituation PASSED

org.apache.kafka.clients.producer.internals.BufferPoolTest > testCleanupMemoryAvailabilityWaiterOnBlockTimeout
STARTED

org.apache.kafka.clients.producer.internals.BufferPoolTest > testCleanupMemoryAvailabilityWaiterOnBlockTimeout
PASSED

org.apache.kafka.clients.producer.internals.BufferPoolTest > testCleanupMemoryAvailabilityWaiterOnInterruption
STARTED

org.apache.kafka.clients.producer.internals.BufferPoolTest > testCleanupMemoryAvailabilityWaiterOnInterruption
PASSED

org.apache.kafka.clients.producer.internals.BufferPoolTest > testLargeAvailableMemory STARTED

org.apache.kafka.clients.producer.internals.BufferPoolTest > testLargeAvailableMemory PASSED

org.apache.kafka.clients.producer.internals.BufferPoolTest > testDelayedAllocation STARTED

org.apache.kafka.clients.producer.internals.BufferPoolTest > testDelayedAllocation PASSED

org.apache.kafka.clients.producer.internals.BufferPoolTest > testCantAllocateMoreMemoryThanWeHave
STARTED

org.apache.kafka.clients.producer.internals.BufferPoolTest > testCantAllocateMoreMemoryThanWeHave
PASSED

org.apache.kafka.clients.producer.internals.BufferPoolTest > outOfMemoryOnAllocation STARTED

org.apache.kafka.clients.producer.internals.BufferPoolTest > outOfMemoryOnAllocation PASSED

org.apache.kafka.clients.producer.internals.BufferPoolTest > testBlockTimeout STARTED

org.apache.kafka.clients.producer.internals.BufferPoolTest > testBlockTimeout PASSED

org.apache.kafka.clients.producer.internals.BufferPoolTest > testCleanupMemoryAvailabilityOnMetricsException
STARTED

org.apache.kafka.clients.producer.internals.BufferPoolTest > testCleanupMemoryAvailabilityOnMetricsException
PASSED

org.apache.kafka.clients.producer.internals.ProducerInterceptorsTest > testOnAcknowledgementWithErrorChain
STARTED

org.apache.kafka.clients.producer.internals.ProducerInterceptorsTest > testOnAcknowledgementWithErrorChain
PASSED

org.apache.kafka.clients.producer.internals.ProducerInterceptorsTest > testOnAcknowledgementChain
STARTED

org.apache.kafka.clients.producer.internals.ProducerInterceptorsTest > testOnAcknowledgementChain
PASSED

org.apache.kafka.clients.producer.internals.ProducerInterceptorsTest > testOnSendChain
STARTED

org.apache.kafka.clients.producer.internals.ProducerInterceptorsTest > testOnSendChain
PASSED

org.apache.kafka.clients.producer.internals.SenderTest > testIdempotentSplitBatchAndSend
STARTED

org.apache.kafka.clients.producer.internals.SenderTest > testIdempotentSplitBatchAndSend
PASSED

org.apache.kafka.clients.producer.internals.SenderTest > testMetadataTopicExpiry STARTED

org.apache.kafka.clients.producer.internals.SenderTest > testMetadataTopicExpiry PASSED

org.apache.kafka.clients.producer.internals.SenderTest > testMessageFormatDownConversion
STARTED

org.apache.kafka.clients.producer.internals.SenderTest > testMessageFormatDownConversion
PASSED

org.apache.kafka.clients.producer.internals.SenderTest > testQuotaMetrics STARTED

org.apache.kafka.clients.producer.internals.SenderTest > testQuotaMetrics PASSED

org.apache.kafka.clients.producer.internals.SenderTest > testTransactionalSplitBatchAndSend
STARTED

org.apache.kafka.clients.producer.internals.SenderTest > testTransactionalSplitBatchAndSend
PASSED

org.apache.kafka.clients.producer.internals.SenderTest > testClusterAuthorizationExceptionInProduceRequest
STARTED

org.apache.kafka.clients.producer.internals.SenderTest > testClusterAuthorizationExceptionInProduceRequest
PASSED

org.apache.kafka.clients.producer.internals.SenderTest > testAppendInExpiryCallback STARTED

org.apache.kafka.clients.producer.internals.SenderTest > testAppendInExpiryCallback PASSED

org.apache.kafka.clients.producer.internals.SenderTest > testAbortRetryWhenProducerIdChanges
STARTED

org.apache.kafka.clients.producer.internals.SenderTest > testAbortRetryWhenProducerIdChanges
PASSED

org.apache.kafka.clients.producer.internals.SenderTest > testInitProducerIdRequest STARTED

org.apache.kafka.clients.producer.internals.SenderTest > testInitProducerIdRequest PASSED

org.apache.kafka.clients.producer.internals.SenderTest > testResetWhenOutOfOrderSequenceReceived
STARTED

org.apache.kafka.clients.producer.internals.SenderTest > testResetWhenOutOfOrderSequenceReceived
PASSED

org.apache.kafka.clients.producer.internals.SenderTest > testRetries STARTED

org.apache.kafka.clients.producer.internals.SenderTest > testRetries PASSED

org.apache.kafka.clients.producer.internals.SenderTest > testDownConversionForMismatchedMagicValues
STARTED

org.apache.kafka.clients.producer.internals.SenderTest > testDownConversionForMismatchedMagicValues
PASSED

org.apache.kafka.clients.producer.internals.SenderTest > testSendInOrder STARTED

org.apache.kafka.clients.producer.internals.SenderTest > testSendInOrder PASSED

org.apache.kafka.clients.producer.internals.SenderTest > testClusterAuthorizationExceptionInInitProducerIdRequest
STARTED

org.apache.kafka.clients.producer.internals.SenderTest > testClusterAuthorizationExceptionInInitProducerIdRequest
PASSED

org.apache.kafka.clients.producer.internals.SenderTest > testSimple STARTED

org.apache.kafka.clients.producer.internals.SenderTest > testSimple PASSED

org.apache.kafka.clients.producer.internals.SenderTest > testSequenceNumberIncrement STARTED

org.apache.kafka.clients.producer.internals.SenderTest > testSequenceNumberIncrement PASSED

org.apache.kafka.clients.producer.internals.DefaultPartitionerTest > testKeyPartitionIsStable
STARTED

org.apache.kafka.clients.producer.internals.DefaultPartitionerTest > testKeyPartitionIsStable
PASSED

org.apache.kafka.clients.producer.internals.DefaultPartitionerTest > testRoundRobin STARTED

org.apache.kafka.clients.producer.internals.DefaultPartitionerTest > testRoundRobin PASSED

org.apache.kafka.clients.producer.internals.DefaultPartitionerTest > testRoundRobinWithUnavailablePartitions
STARTED

org.apache.kafka.clients.producer.internals.DefaultPartitionerTest > testRoundRobinWithUnavailablePartitions
PASSED

org.apache.kafka.clients.CommonClientConfigsTest > testExponentialBackoffDefaults STARTED

org.apache.kafka.clients.CommonClientConfigsTest > testExponentialBackoffDefaults PASSED

3873 tests completed, 2 failed
:clients:test FAILED

FAILURE: Build failed with an exception.

* What went wrong:
Execution failed for task ':clients:test'.
> There were failing tests. See the report at: file://<https://builds.apache.org/job/kafka-trunk-jdk7/ws/clients/build/reports/tests/test/index.html>

* Try:
Run with --stacktrace option to get the stack trace. Run with --info or --debug option to
get more log output.

BUILD FAILED

Total time: 46 mins 16.109 secs
Build step 'Execute shell' marked build as failure
[FINDBUGS] Collecting findbugs analysis files...
Setting GRADLE_3_4_RC_2_HOME=/home/jenkins/jenkins-slave/tools/hudson.plugins.gradle.GradleInstallation/Gradle_3.4-rc-2
[FINDBUGS] Searching for all files in <https://builds.apache.org/job/kafka-trunk-jdk7/ws/>
that match the pattern **/build/reports/findbugs/*.xml
[FINDBUGS] Parsing 2 files in <https://builds.apache.org/job/kafka-trunk-jdk7/ws/>
[FINDBUGS] Successfully parsed file <https://builds.apache.org/job/kafka-trunk-jdk7/ws/clients/build/reports/findbugs/main.xml>
with 0 unique warnings and 0 duplicates.
[FINDBUGS] Successfully parsed file <https://builds.apache.org/job/kafka-trunk-jdk7/ws/core/build/reports/findbugs/main.xml>
with 0 unique warnings and 0 duplicates.
Setting GRADLE_3_4_RC_2_HOME=/home/jenkins/jenkins-slave/tools/hudson.plugins.gradle.GradleInstallation/Gradle_3.4-rc-2
<Git Blamer> Using GitBlamer to create author and commit information for all warnings.
<Git Blamer> Getting blame results for all files in <https://builds.apache.org/job/kafka-trunk-jdk7/ws/.>
[FINDBUGS] Computing warning deltas based on reference build #2523
Recording test results
Setting GRADLE_3_4_RC_2_HOME=/home/jenkins/jenkins-slave/tools/hudson.plugins.gradle.GradleInstallation/Gradle_3.4-rc-2
ERROR: Could not install GRADLE_3_4_RC_2_HOME
java.lang.NullPointerException
	at hudson.plugins.toolenv.ToolEnvBuildWrapper$1.buildEnvVars(ToolEnvBuildWrapper.java:46)
	at hudson.model.AbstractBuild.getEnvironment(AbstractBuild.java:886)
	at hudson.plugins.git.GitSCM.getParamExpandedRepos(GitSCM.java:419)
	at hudson.plugins.git.GitSCM.compareRemoteRevisionWithImpl(GitSCM.java:625)
	at hudson.plugins.git.GitSCM.compareRemoteRevisionWith(GitSCM.java:590)
	at hudson.scm.SCM.compareRemoteRevisionWith(SCM.java:391)
	at hudson.scm.SCM.poll(SCM.java:408)
	at hudson.model.AbstractProject._poll(AbstractProject.java:1458)
	at hudson.model.AbstractProject.poll(AbstractProject.java:1361)
	at hudson.triggers.SCMTrigger$Runner.runPolling(SCMTrigger.java:594)
	at hudson.triggers.SCMTrigger$Runner.run(SCMTrigger.java:640)
	at hudson.util.SequentialExecutionQueue$QueueEntry.run(SequentialExecutionQueue.java:119)
	at java.util.concurrent.Executors$RunnableAdapter.call(Executors.java:511)
	at java.util.concurrent.FutureTask.run(FutureTask.java:266)
	at java.util.concurrent.ThreadPoolExecutor.runWorker(ThreadPoolExecutor.java:1142)
	at java.util.concurrent.ThreadPoolExecutor$Worker.run(ThreadPoolExecutor.java:617)
	at java.lang.Thread.run(Thread.java:748)
Setting GRADLE_3_4_RC_2_HOME=/home/jenkins/jenkins-slave/tools/hudson.plugins.gradle.GradleInstallation/Gradle_3.4-rc-2
Not sending mail to unregistered user ismael@juma.me.uk

Mime
View raw message