kafka-dev mailing list archives

Site index · List index
Message view « Date » · « Thread »
Top « Date » · « Thread »
From Apache Jenkins Server <jenk...@builds.apache.org>
Subject Build failed in Jenkins: kafka-0.11.0-jdk7 #214
Date Fri, 07 Jul 2017 15:45:07 GMT
See <https://builds.apache.org/job/kafka-0.11.0-jdk7/214/display/redirect?page=changes>

Changes:

[damian.guy] HOTFIX: fix paths in streams index

------------------------------------------
[...truncated 2.42 MB...]

org.apache.kafka.streams.integration.KTableKTableJoinIntegrationTest > shouldInnerLeftJoin
PASSED

org.apache.kafka.streams.integration.KTableKTableJoinIntegrationTest > shouldOuterOuterJoin
STARTED

org.apache.kafka.streams.integration.KTableKTableJoinIntegrationTest > shouldOuterOuterJoin
PASSED

org.apache.kafka.streams.integration.KTableKTableJoinIntegrationTest > shouldInnerOuterJoin
STARTED

org.apache.kafka.streams.integration.KTableKTableJoinIntegrationTest > shouldInnerOuterJoin
PASSED

org.apache.kafka.streams.integration.KTableKTableJoinIntegrationTest > shouldLeftInnerJoin
STARTED

org.apache.kafka.streams.integration.KTableKTableJoinIntegrationTest > shouldLeftInnerJoin
PASSED

org.apache.kafka.streams.integration.KTableKTableJoinIntegrationTest > shouldInnerInnerJoinQueryable
STARTED

org.apache.kafka.streams.integration.KTableKTableJoinIntegrationTest > shouldInnerInnerJoinQueryable
PASSED

org.apache.kafka.streams.integration.KTableKTableJoinIntegrationTest > shouldInnerOuterJoinQueryable
STARTED

org.apache.kafka.streams.integration.KTableKTableJoinIntegrationTest > shouldInnerOuterJoinQueryable
PASSED

org.apache.kafka.streams.integration.KTableKTableJoinIntegrationTest > shouldOuterLeftJoin
STARTED

org.apache.kafka.streams.integration.KTableKTableJoinIntegrationTest > shouldOuterLeftJoin
PASSED

org.apache.kafka.streams.integration.KTableKTableJoinIntegrationTest > shouldOuterInnerJoin
STARTED

org.apache.kafka.streams.integration.KTableKTableJoinIntegrationTest > shouldOuterInnerJoin
PASSED

org.apache.kafka.streams.integration.KTableKTableJoinIntegrationTest > shouldInnerInnerJoin
STARTED

org.apache.kafka.streams.integration.KTableKTableJoinIntegrationTest > shouldInnerInnerJoin
PASSED

org.apache.kafka.streams.integration.KTableKTableJoinIntegrationTest > shouldLeftOuterJoin
STARTED

org.apache.kafka.streams.integration.KTableKTableJoinIntegrationTest > shouldLeftOuterJoin
PASSED

org.apache.kafka.streams.integration.KTableKTableJoinIntegrationTest > shouldOuterLeftJoinQueryable
STARTED

org.apache.kafka.streams.integration.KTableKTableJoinIntegrationTest > shouldOuterLeftJoinQueryable
PASSED

org.apache.kafka.streams.integration.KTableKTableJoinIntegrationTest > shouldLeftLeftJoin
STARTED

org.apache.kafka.streams.integration.KTableKTableJoinIntegrationTest > shouldLeftLeftJoin
PASSED

org.apache.kafka.streams.integration.KTableKTableJoinIntegrationTest > shouldOuterInnerJoinQueryable
STARTED

org.apache.kafka.streams.integration.KTableKTableJoinIntegrationTest > shouldOuterInnerJoinQueryable
PASSED

org.apache.kafka.streams.integration.KTableKTableJoinIntegrationTest > shouldLeftInnerJoinQueryable
STARTED

org.apache.kafka.streams.integration.KTableKTableJoinIntegrationTest > shouldLeftInnerJoinQueryable
PASSED

org.apache.kafka.streams.integration.KTableKTableJoinIntegrationTest > shouldInnerLeftJoinQueryable
STARTED

org.apache.kafka.streams.integration.KTableKTableJoinIntegrationTest > shouldInnerLeftJoinQueryable
PASSED

org.apache.kafka.streams.integration.KTableKTableJoinIntegrationTest > shouldLeftLeftJoinQueryable
STARTED

org.apache.kafka.streams.integration.KTableKTableJoinIntegrationTest > shouldLeftLeftJoinQueryable
PASSED

org.apache.kafka.streams.integration.KTableKTableJoinIntegrationTest > shouldOuterOuterJoinQueryable
STARTED

org.apache.kafka.streams.integration.KTableKTableJoinIntegrationTest > shouldOuterOuterJoinQueryable
PASSED

org.apache.kafka.streams.integration.KStreamRepartitionJoinTest > shouldCorrectlyRepartitionOnJoinOperationsWithZeroSizedCache
STARTED

org.apache.kafka.streams.integration.KStreamRepartitionJoinTest > shouldCorrectlyRepartitionOnJoinOperationsWithZeroSizedCache
PASSED

org.apache.kafka.streams.integration.KStreamRepartitionJoinTest > shouldCorrectlyRepartitionOnJoinOperationsWithNonZeroSizedCache
STARTED

org.apache.kafka.streams.integration.KStreamRepartitionJoinTest > shouldCorrectlyRepartitionOnJoinOperationsWithNonZeroSizedCache
PASSED

org.apache.kafka.streams.integration.InternalTopicIntegrationTest > shouldCompactTopicsForStateChangelogs
STARTED

org.apache.kafka.streams.integration.InternalTopicIntegrationTest > shouldCompactTopicsForStateChangelogs
PASSED

org.apache.kafka.streams.integration.InternalTopicIntegrationTest > shouldUseCompactAndDeleteForWindowStoreChangelogs
STARTED

org.apache.kafka.streams.integration.InternalTopicIntegrationTest > shouldUseCompactAndDeleteForWindowStoreChangelogs
PASSED

org.apache.kafka.streams.integration.KStreamsFineGrainedAutoResetIntegrationTest > shouldOnlyReadRecordsWhereEarliestSpecifiedWithNoCommittedOffsetsWithGlobalAutoOffsetResetLatest
STARTED

org.apache.kafka.streams.integration.KStreamsFineGrainedAutoResetIntegrationTest > shouldOnlyReadRecordsWhereEarliestSpecifiedWithNoCommittedOffsetsWithGlobalAutoOffsetResetLatest
PASSED

org.apache.kafka.streams.integration.KStreamsFineGrainedAutoResetIntegrationTest > shouldThrowExceptionOverlappingPattern
STARTED

org.apache.kafka.streams.integration.KStreamsFineGrainedAutoResetIntegrationTest > shouldThrowExceptionOverlappingPattern
PASSED

org.apache.kafka.streams.integration.KStreamsFineGrainedAutoResetIntegrationTest > shouldThrowExceptionOverlappingTopic
STARTED

org.apache.kafka.streams.integration.KStreamsFineGrainedAutoResetIntegrationTest > shouldThrowExceptionOverlappingTopic
PASSED

org.apache.kafka.streams.integration.KStreamsFineGrainedAutoResetIntegrationTest > shouldOnlyReadRecordsWhereEarliestSpecifiedWithInvalidCommittedOffsets
STARTED

org.apache.kafka.streams.integration.KStreamsFineGrainedAutoResetIntegrationTest > shouldOnlyReadRecordsWhereEarliestSpecifiedWithInvalidCommittedOffsets
PASSED

org.apache.kafka.streams.integration.KStreamsFineGrainedAutoResetIntegrationTest > shouldOnlyReadRecordsWhereEarliestSpecifiedWithNoCommittedOffsetsWithDefaultGlobalAutoOffsetResetEarliest
STARTED

org.apache.kafka.streams.integration.KStreamsFineGrainedAutoResetIntegrationTest > shouldOnlyReadRecordsWhereEarliestSpecifiedWithNoCommittedOffsetsWithDefaultGlobalAutoOffsetResetEarliest
PASSED

org.apache.kafka.streams.integration.KStreamsFineGrainedAutoResetIntegrationTest > shouldThrowStreamsExceptionNoResetSpecified
STARTED

org.apache.kafka.streams.integration.KStreamsFineGrainedAutoResetIntegrationTest > shouldThrowStreamsExceptionNoResetSpecified
PASSED

org.apache.kafka.streams.integration.QueryableStateIntegrationTest > shouldBeAbleToQueryMapValuesState
STARTED

org.apache.kafka.streams.integration.QueryableStateIntegrationTest > shouldBeAbleToQueryMapValuesState
PASSED

org.apache.kafka.streams.integration.QueryableStateIntegrationTest > shouldNotMakeStoreAvailableUntilAllStoresAvailable
STARTED

org.apache.kafka.streams.integration.QueryableStateIntegrationTest > shouldNotMakeStoreAvailableUntilAllStoresAvailable
PASSED

org.apache.kafka.streams.integration.QueryableStateIntegrationTest > queryOnRebalance STARTED

org.apache.kafka.streams.integration.QueryableStateIntegrationTest > queryOnRebalance PASSED

org.apache.kafka.streams.integration.QueryableStateIntegrationTest > concurrentAccesses
STARTED

org.apache.kafka.streams.integration.QueryableStateIntegrationTest > concurrentAccesses
PASSED

org.apache.kafka.streams.integration.QueryableStateIntegrationTest > shouldAllowToQueryAfterThreadDied
STARTED

org.apache.kafka.streams.integration.QueryableStateIntegrationTest > shouldAllowToQueryAfterThreadDied
FAILED
    java.lang.AssertionError: Condition not met within timeout 30000. wait for agg to be '123'
        at org.apache.kafka.test.TestUtils.waitForCondition(TestUtils.java:274)
        at org.apache.kafka.streams.integration.QueryableStateIntegrationTest.shouldAllowToQueryAfterThreadDied(QueryableStateIntegrationTest.java:794)

org.apache.kafka.streams.integration.QueryableStateIntegrationTest > shouldBeAbleToQueryStateWithZeroSizedCache
STARTED

org.apache.kafka.streams.integration.QueryableStateIntegrationTest > shouldBeAbleToQueryStateWithZeroSizedCache
PASSED

org.apache.kafka.streams.integration.QueryableStateIntegrationTest > shouldBeAbleToQueryMapValuesAfterFilterState
STARTED

org.apache.kafka.streams.integration.QueryableStateIntegrationTest > shouldBeAbleToQueryMapValuesAfterFilterState
PASSED

org.apache.kafka.streams.integration.QueryableStateIntegrationTest > shouldBeAbleToQueryFilterState
STARTED

org.apache.kafka.streams.integration.QueryableStateIntegrationTest > shouldBeAbleToQueryFilterState
PASSED

org.apache.kafka.streams.integration.QueryableStateIntegrationTest > shouldBeAbleToQueryStateWithNonZeroSizedCache
STARTED

org.apache.kafka.streams.integration.QueryableStateIntegrationTest > shouldBeAbleToQueryStateWithNonZeroSizedCache
PASSED

org.apache.kafka.streams.integration.KStreamAggregationDedupIntegrationTest > shouldReduce
STARTED

org.apache.kafka.streams.integration.KStreamAggregationDedupIntegrationTest > shouldReduce
PASSED

org.apache.kafka.streams.integration.KStreamAggregationDedupIntegrationTest > shouldGroupByKey
STARTED

org.apache.kafka.streams.integration.KStreamAggregationDedupIntegrationTest > shouldGroupByKey
PASSED

org.apache.kafka.streams.integration.KStreamAggregationDedupIntegrationTest > shouldReduceWindowed
STARTED

org.apache.kafka.streams.integration.KStreamAggregationDedupIntegrationTest > shouldReduceWindowed
PASSED

org.apache.kafka.streams.KafkaStreamsTest > testIllegalMetricsConfig STARTED

org.apache.kafka.streams.KafkaStreamsTest > testIllegalMetricsConfig PASSED

org.apache.kafka.streams.KafkaStreamsTest > shouldNotGetAllTasksWhenNotRunning STARTED

org.apache.kafka.streams.KafkaStreamsTest > shouldNotGetAllTasksWhenNotRunning PASSED

org.apache.kafka.streams.KafkaStreamsTest > testInitializesAndDestroysMetricsReporters
STARTED

org.apache.kafka.streams.KafkaStreamsTest > testInitializesAndDestroysMetricsReporters
PASSED

org.apache.kafka.streams.KafkaStreamsTest > shouldNotGetTaskWithKeyAndPartitionerWhenNotRunning
STARTED

org.apache.kafka.streams.KafkaStreamsTest > shouldNotGetTaskWithKeyAndPartitionerWhenNotRunning
PASSED

org.apache.kafka.streams.KafkaStreamsTest > testLegalMetricsConfig STARTED

org.apache.kafka.streams.KafkaStreamsTest > testLegalMetricsConfig PASSED

org.apache.kafka.streams.KafkaStreamsTest > shouldNotGetTaskWithKeyAndSerializerWhenNotRunning
STARTED

org.apache.kafka.streams.KafkaStreamsTest > shouldNotGetTaskWithKeyAndSerializerWhenNotRunning
PASSED

org.apache.kafka.streams.KafkaStreamsTest > testToString STARTED

org.apache.kafka.streams.KafkaStreamsTest > testToString PASSED

org.apache.kafka.streams.KafkaStreamsTest > shouldReturnFalseOnCloseWhenThreadsHaventTerminated
STARTED

org.apache.kafka.streams.KafkaStreamsTest > shouldReturnFalseOnCloseWhenThreadsHaventTerminated
PASSED

org.apache.kafka.streams.KafkaStreamsTest > shouldNotGetAllTasksWithStoreWhenNotRunning
STARTED

org.apache.kafka.streams.KafkaStreamsTest > shouldNotGetAllTasksWithStoreWhenNotRunning
PASSED

org.apache.kafka.streams.KafkaStreamsTest > testCannotStartOnceClosed STARTED

org.apache.kafka.streams.KafkaStreamsTest > testCannotStartOnceClosed PASSED

org.apache.kafka.streams.KafkaStreamsTest > testCleanup STARTED

org.apache.kafka.streams.KafkaStreamsTest > testCleanup PASSED

org.apache.kafka.streams.KafkaStreamsTest > testNumberDefaultMetrics STARTED

org.apache.kafka.streams.KafkaStreamsTest > testNumberDefaultMetrics PASSED

org.apache.kafka.streams.KafkaStreamsTest > testCloseIsIdempotent STARTED

org.apache.kafka.streams.KafkaStreamsTest > testCloseIsIdempotent PASSED

org.apache.kafka.streams.KafkaStreamsTest > testCannotCleanupWhileRunning STARTED

org.apache.kafka.streams.KafkaStreamsTest > testCannotCleanupWhileRunning PASSED

org.apache.kafka.streams.KafkaStreamsTest > testCannotStartTwice STARTED

org.apache.kafka.streams.KafkaStreamsTest > testCannotStartTwice PASSED

1194 tests completed, 1 failed
:streams:test FAILED

FAILURE: Build failed with an exception.

* What went wrong:
Execution failed for task ':streams:test'.
> There were failing tests. See the report at: file://<https://builds.apache.org/job/kafka-0.11.0-jdk7/ws/streams/build/reports/tests/test/index.html>

* Try:
Run with --stacktrace option to get the stack trace. Run with --info or --debug option to
get more log output.

BUILD FAILED

Total time: 1 hrs 0 mins 53.345 secs
Build step 'Execute shell' marked build as failure
[FINDBUGS] Collecting findbugs analysis files...
Setting GRADLE_3_4_RC_2_HOME=/home/jenkins/jenkins-slave/tools/hudson.plugins.gradle.GradleInstallation/Gradle_3.4-rc-2
[FINDBUGS] Searching for all files in <https://builds.apache.org/job/kafka-0.11.0-jdk7/ws/>
that match the pattern **/build/reports/findbugs/*.xml
[FINDBUGS] Parsing 5 files in <https://builds.apache.org/job/kafka-0.11.0-jdk7/ws/>
[FINDBUGS] Successfully parsed file <https://builds.apache.org/job/kafka-0.11.0-jdk7/ws/clients/build/reports/findbugs/main.xml>
with 0 unique warnings and 0 duplicates.
[FINDBUGS] Successfully parsed file <https://builds.apache.org/job/kafka-0.11.0-jdk7/ws/core/build/reports/findbugs/main.xml>
with 0 unique warnings and 0 duplicates.
[FINDBUGS] Successfully parsed file <https://builds.apache.org/job/kafka-0.11.0-jdk7/ws/examples/build/reports/findbugs/main.xml>
with 0 unique warnings and 0 duplicates.
[FINDBUGS] Successfully parsed file <https://builds.apache.org/job/kafka-0.11.0-jdk7/ws/log4j-appender/build/reports/findbugs/main.xml>
with 0 unique warnings and 0 duplicates.
[FINDBUGS] Successfully parsed file <https://builds.apache.org/job/kafka-0.11.0-jdk7/ws/streams/build/reports/findbugs/main.xml>
with 0 unique warnings and 0 duplicates.
[FINDBUGS] Computing warning deltas based on reference build #212
Recording test results
Setting GRADLE_3_4_RC_2_HOME=/home/jenkins/jenkins-slave/tools/hudson.plugins.gradle.GradleInstallation/Gradle_3.4-rc-2
Setting GRADLE_3_4_RC_2_HOME=/home/jenkins/jenkins-slave/tools/hudson.plugins.gradle.GradleInstallation/Gradle_3.4-rc-2
Not sending mail to unregistered user ismael@juma.me.uk
Not sending mail to unregistered user damian.guy@gmail.com

Mime
View raw message