kafka-dev mailing list archives

Site index · List index
Message view « Date » · « Thread »
Top « Date » · « Thread »
From Apache Jenkins Server <jenk...@builds.apache.org>
Subject Build failed in Jenkins: kafka-trunk-jdk8 #1825
Date Thu, 20 Jul 2017 10:32:21 GMT
See <https://builds.apache.org/job/kafka-trunk-jdk8/1825/display/redirect?page=changes>

Changes:

[ismael] MINOR: Clarify wording in server.properties comment

------------------------------------------
[...truncated 3.80 MB...]
org.apache.kafka.common.config.ConfigDefTest > testConvertValueToStringInt STARTED

org.apache.kafka.common.config.ConfigDefTest > testConvertValueToStringInt PASSED

org.apache.kafka.common.config.ConfigDefTest > testValidators STARTED

org.apache.kafka.common.config.ConfigDefTest > testValidators PASSED

org.apache.kafka.common.config.ConfigDefTest > testValidateCannotParse STARTED

org.apache.kafka.common.config.ConfigDefTest > testValidateCannotParse PASSED

org.apache.kafka.common.config.ConfigDefTest > testValidate STARTED

org.apache.kafka.common.config.ConfigDefTest > testValidate PASSED

org.apache.kafka.common.config.ConfigDefTest > testInternalConfigDoesntShowUpInDocs STARTED

org.apache.kafka.common.config.ConfigDefTest > testInternalConfigDoesntShowUpInDocs PASSED

org.apache.kafka.common.config.ConfigDefTest > testInvalidDefaultString STARTED

org.apache.kafka.common.config.ConfigDefTest > testInvalidDefaultString PASSED

org.apache.kafka.common.config.ConfigDefTest > testSslPasswords STARTED

org.apache.kafka.common.config.ConfigDefTest > testSslPasswords PASSED

org.apache.kafka.common.config.ConfigDefTest > testBaseConfigDefDependents STARTED

org.apache.kafka.common.config.ConfigDefTest > testBaseConfigDefDependents PASSED

org.apache.kafka.common.config.ConfigDefTest > testConvertValueToStringClass STARTED

org.apache.kafka.common.config.ConfigDefTest > testConvertValueToStringClass PASSED

org.apache.kafka.common.config.ConfigDefTest > testConvertValueToStringShort STARTED

org.apache.kafka.common.config.ConfigDefTest > testConvertValueToStringShort PASSED

org.apache.kafka.common.config.ConfigDefTest > testInvalidDefault STARTED

org.apache.kafka.common.config.ConfigDefTest > testInvalidDefault PASSED

org.apache.kafka.common.config.ConfigDefTest > toRst STARTED

org.apache.kafka.common.config.ConfigDefTest > toRst PASSED

org.apache.kafka.common.config.ConfigDefTest > testCanAddInternalConfig STARTED

org.apache.kafka.common.config.ConfigDefTest > testCanAddInternalConfig PASSED

org.apache.kafka.common.config.ConfigDefTest > testMissingRequired STARTED

org.apache.kafka.common.config.ConfigDefTest > testMissingRequired PASSED

org.apache.kafka.common.config.ConfigDefTest > testParsingEmptyDefaultValueForStringFieldShouldSucceed
STARTED

org.apache.kafka.common.config.ConfigDefTest > testParsingEmptyDefaultValueForStringFieldShouldSucceed
PASSED

org.apache.kafka.common.config.ConfigDefTest > testConvertValueToStringPassword STARTED

org.apache.kafka.common.config.ConfigDefTest > testConvertValueToStringPassword PASSED

org.apache.kafka.common.config.ConfigDefTest > testConvertValueToStringList STARTED

org.apache.kafka.common.config.ConfigDefTest > testConvertValueToStringList PASSED

org.apache.kafka.common.config.ConfigDefTest > testConvertValueToStringLong STARTED

org.apache.kafka.common.config.ConfigDefTest > testConvertValueToStringLong PASSED

org.apache.kafka.common.config.ConfigDefTest > testConvertValueToStringBoolean STARTED

org.apache.kafka.common.config.ConfigDefTest > testConvertValueToStringBoolean PASSED

org.apache.kafka.common.config.ConfigDefTest > testNullDefaultWithValidator STARTED

org.apache.kafka.common.config.ConfigDefTest > testNullDefaultWithValidator PASSED

org.apache.kafka.common.config.ConfigDefTest > testMissingDependentConfigs STARTED

org.apache.kafka.common.config.ConfigDefTest > testMissingDependentConfigs PASSED

org.apache.kafka.common.config.ConfigDefTest > testConvertValueToStringDouble STARTED

org.apache.kafka.common.config.ConfigDefTest > testConvertValueToStringDouble PASSED

org.apache.kafka.common.config.ConfigDefTest > toEnrichedRst STARTED

org.apache.kafka.common.config.ConfigDefTest > toEnrichedRst PASSED

org.apache.kafka.common.config.ConfigDefTest > testDefinedTwice STARTED

org.apache.kafka.common.config.ConfigDefTest > testDefinedTwice PASSED

org.apache.kafka.common.config.ConfigDefTest > testConvertValueToStringString STARTED

org.apache.kafka.common.config.ConfigDefTest > testConvertValueToStringString PASSED

org.apache.kafka.common.config.ConfigDefTest > testNestedClass STARTED

org.apache.kafka.common.config.ConfigDefTest > testNestedClass PASSED

org.apache.kafka.common.config.ConfigDefTest > testBadInputs STARTED

org.apache.kafka.common.config.ConfigDefTest > testBadInputs PASSED

org.apache.kafka.common.config.ConfigDefTest > testValidateMissingConfigKey STARTED

org.apache.kafka.common.config.ConfigDefTest > testValidateMissingConfigKey PASSED

org.apache.kafka.common.config.AbstractConfigTest > testOriginalsWithPrefix STARTED

org.apache.kafka.common.config.AbstractConfigTest > testOriginalsWithPrefix PASSED

org.apache.kafka.common.config.AbstractConfigTest > testConfiguredInstances STARTED

org.apache.kafka.common.config.AbstractConfigTest > testConfiguredInstances PASSED

org.apache.kafka.common.config.AbstractConfigTest > testValuesWithPrefixOverride STARTED

org.apache.kafka.common.config.AbstractConfigTest > testValuesWithPrefixOverride PASSED

org.apache.kafka.common.config.AbstractConfigTest > testUnused STARTED

org.apache.kafka.common.config.AbstractConfigTest > testUnused PASSED

org.apache.kafka.common.config.AbstractConfigTest > testClassConfigs STARTED

org.apache.kafka.common.config.AbstractConfigTest > testClassConfigs PASSED

org.apache.kafka.common.acl.AclOperationTest > testCode STARTED

org.apache.kafka.common.acl.AclOperationTest > testCode PASSED

org.apache.kafka.common.acl.AclOperationTest > testName STARTED

org.apache.kafka.common.acl.AclOperationTest > testName PASSED

org.apache.kafka.common.acl.AclOperationTest > testExhaustive STARTED

org.apache.kafka.common.acl.AclOperationTest > testExhaustive PASSED

org.apache.kafka.common.acl.AclOperationTest > testIsUnknown STARTED

org.apache.kafka.common.acl.AclOperationTest > testIsUnknown PASSED

org.apache.kafka.common.acl.AclBindingTest > testUnknowns STARTED

org.apache.kafka.common.acl.AclBindingTest > testUnknowns PASSED

org.apache.kafka.common.acl.AclBindingTest > testMatching STARTED

org.apache.kafka.common.acl.AclBindingTest > testMatching PASSED

org.apache.kafka.common.acl.AclBindingTest > testMatchesAtMostOne STARTED

org.apache.kafka.common.acl.AclBindingTest > testMatchesAtMostOne PASSED

org.apache.kafka.common.acl.AclPermissionTypeTest > testCode STARTED

org.apache.kafka.common.acl.AclPermissionTypeTest > testCode PASSED

org.apache.kafka.common.acl.AclPermissionTypeTest > testName STARTED

org.apache.kafka.common.acl.AclPermissionTypeTest > testName PASSED

org.apache.kafka.common.acl.AclPermissionTypeTest > testExhaustive STARTED

org.apache.kafka.common.acl.AclPermissionTypeTest > testExhaustive PASSED

org.apache.kafka.common.acl.AclPermissionTypeTest > testIsUnknown STARTED

org.apache.kafka.common.acl.AclPermissionTypeTest > testIsUnknown PASSED

org.apache.kafka.common.internals.PartitionStatesTest > testSet STARTED

org.apache.kafka.common.internals.PartitionStatesTest > testSet PASSED

org.apache.kafka.common.internals.PartitionStatesTest > testClear STARTED

org.apache.kafka.common.internals.PartitionStatesTest > testClear PASSED

org.apache.kafka.common.internals.PartitionStatesTest > testRemove STARTED

org.apache.kafka.common.internals.PartitionStatesTest > testRemove PASSED

org.apache.kafka.common.internals.PartitionStatesTest > testMoveToEnd STARTED

org.apache.kafka.common.internals.PartitionStatesTest > testMoveToEnd PASSED

org.apache.kafka.common.internals.PartitionStatesTest > testUpdateAndMoveToEnd STARTED

org.apache.kafka.common.internals.PartitionStatesTest > testUpdateAndMoveToEnd PASSED

org.apache.kafka.common.internals.PartitionStatesTest > testPartitionValues STARTED

org.apache.kafka.common.internals.PartitionStatesTest > testPartitionValues PASSED

org.apache.kafka.common.internals.TopicTest > shouldThrowOnInvalidTopicNames STARTED

org.apache.kafka.common.internals.TopicTest > shouldThrowOnInvalidTopicNames PASSED

org.apache.kafka.common.internals.TopicTest > shouldAcceptValidTopicNames STARTED

org.apache.kafka.common.internals.TopicTest > shouldAcceptValidTopicNames PASSED

org.apache.kafka.common.internals.TopicTest > testTopicHasCollision STARTED

org.apache.kafka.common.internals.TopicTest > testTopicHasCollision PASSED

org.apache.kafka.common.internals.TopicTest > testTopicHasCollisionChars STARTED

org.apache.kafka.common.internals.TopicTest > testTopicHasCollisionChars PASSED

org.apache.kafka.common.internals.TopicTest > shouldRecognizeInvalidCharactersInTopicNames
STARTED

org.apache.kafka.common.internals.TopicTest > shouldRecognizeInvalidCharactersInTopicNames
PASSED

3873 tests completed, 1 failed
:clients:test FAILED

FAILURE: Build failed with an exception.

* What went wrong:
Execution failed for task ':clients:test'.
> There were failing tests. See the report at: file://<https://builds.apache.org/job/kafka-trunk-jdk8/ws/clients/build/reports/tests/test/index.html>

* Try:
Run with --stacktrace option to get the stack trace. Run with --info or --debug option to
get more log output.

BUILD FAILED

Total time: 3 mins 11.629 secs
Build step 'Execute shell' marked build as failure
[FINDBUGS] Collecting findbugs analysis files...
Setting GRADLE_3_4_RC_2_HOME=/home/jenkins/jenkins-slave/tools/hudson.plugins.gradle.GradleInstallation/Gradle_3.4-rc-2
[FINDBUGS] Searching for all files in <https://builds.apache.org/job/kafka-trunk-jdk8/ws/>
that match the pattern **/build/reports/findbugs/*.xml
[FINDBUGS] Parsing 1 file in <https://builds.apache.org/job/kafka-trunk-jdk8/ws/>
[FINDBUGS] Successfully parsed file <https://builds.apache.org/job/kafka-trunk-jdk8/ws/clients/build/reports/findbugs/main.xml>
with 0 unique warnings and 0 duplicates.
Setting GRADLE_3_4_RC_2_HOME=/home/jenkins/jenkins-slave/tools/hudson.plugins.gradle.GradleInstallation/Gradle_3.4-rc-2
<Git Blamer> Using GitBlamer to create author and commit information for all warnings.
<Git Blamer> Getting blame results for all files in <https://builds.apache.org/job/kafka-trunk-jdk8/ws/.>
[FINDBUGS] Computing warning deltas based on reference build #1824
Recording test results
Setting GRADLE_3_4_RC_2_HOME=/home/jenkins/jenkins-slave/tools/hudson.plugins.gradle.GradleInstallation/Gradle_3.4-rc-2
Setting GRADLE_3_4_RC_2_HOME=/home/jenkins/jenkins-slave/tools/hudson.plugins.gradle.GradleInstallation/Gradle_3.4-rc-2
Not sending mail to unregistered user ismael@juma.me.uk

Mime
View raw message