kafka-dev mailing list archives

Site index · List index
Message view « Date » · « Thread »
Top « Date » · « Thread »
From Apache Jenkins Server <jenk...@builds.apache.org>
Subject Build failed in Jenkins: kafka-trunk-jdk7 #2455
Date Fri, 23 Jun 2017 12:46:55 GMT
See <https://builds.apache.org/job/kafka-trunk-jdk7/2455/display/redirect?page=changes>

Changes:

[damian.guy] KAFKA-4653; Improve test coverage of RocksDBStore

------------------------------------------
[...truncated 2.59 MB...]
org.apache.kafka.connect.runtime.WorkerConnectorTest > testFailureIsFinalState PASSED

org.apache.kafka.connect.runtime.WorkerConnectorTest > testInitializeFailure STARTED

org.apache.kafka.connect.runtime.WorkerConnectorTest > testInitializeFailure PASSED

org.apache.kafka.connect.runtime.WorkerConnectorTest > testStartupAndPause STARTED

org.apache.kafka.connect.runtime.WorkerConnectorTest > testStartupAndPause PASSED

org.apache.kafka.connect.runtime.WorkerConnectorTest > testStartupAndShutdown STARTED

org.apache.kafka.connect.runtime.WorkerConnectorTest > testStartupAndShutdown PASSED

org.apache.kafka.connect.runtime.WorkerConnectorTest > testTransitionStartedToStarted STARTED

org.apache.kafka.connect.runtime.WorkerConnectorTest > testTransitionStartedToStarted PASSED

org.apache.kafka.connect.runtime.WorkerConnectorTest > testShutdownFailure STARTED

org.apache.kafka.connect.runtime.WorkerConnectorTest > testShutdownFailure PASSED

org.apache.kafka.connect.converters.ByteArrayConverterTest > testFromConnectSchemaless
STARTED

org.apache.kafka.connect.converters.ByteArrayConverterTest > testFromConnectSchemaless
PASSED

org.apache.kafka.connect.converters.ByteArrayConverterTest > testToConnectNull STARTED

org.apache.kafka.connect.converters.ByteArrayConverterTest > testToConnectNull PASSED

org.apache.kafka.connect.converters.ByteArrayConverterTest > testFromConnectBadSchema STARTED

org.apache.kafka.connect.converters.ByteArrayConverterTest > testFromConnectBadSchema PASSED

org.apache.kafka.connect.converters.ByteArrayConverterTest > testFromConnectNull STARTED

org.apache.kafka.connect.converters.ByteArrayConverterTest > testFromConnectNull PASSED

org.apache.kafka.connect.converters.ByteArrayConverterTest > testToConnect STARTED

org.apache.kafka.connect.converters.ByteArrayConverterTest > testToConnect PASSED

org.apache.kafka.connect.converters.ByteArrayConverterTest > testFromConnect STARTED

org.apache.kafka.connect.converters.ByteArrayConverterTest > testFromConnect PASSED

org.apache.kafka.connect.converters.ByteArrayConverterTest > testFromConnectInvalidValue
STARTED

org.apache.kafka.connect.converters.ByteArrayConverterTest > testFromConnectInvalidValue
PASSED

org.apache.kafka.connect.storage.OffsetStorageWriterTest > testNoOffsetsToFlush STARTED

org.apache.kafka.connect.storage.OffsetStorageWriterTest > testNoOffsetsToFlush PASSED

org.apache.kafka.connect.storage.OffsetStorageWriterTest > testFlushFailureReplacesOffsets
STARTED

org.apache.kafka.connect.storage.OffsetStorageWriterTest > testFlushFailureReplacesOffsets
PASSED

org.apache.kafka.connect.storage.OffsetStorageWriterTest > testAlreadyFlushing STARTED

org.apache.kafka.connect.storage.OffsetStorageWriterTest > testAlreadyFlushing PASSED

org.apache.kafka.connect.storage.OffsetStorageWriterTest > testCancelBeforeAwaitFlush STARTED

org.apache.kafka.connect.storage.OffsetStorageWriterTest > testCancelBeforeAwaitFlush PASSED

org.apache.kafka.connect.storage.OffsetStorageWriterTest > testCancelAfterAwaitFlush STARTED

org.apache.kafka.connect.storage.OffsetStorageWriterTest > testCancelAfterAwaitFlush PASSED

org.apache.kafka.connect.storage.OffsetStorageWriterTest > testWriteFlush STARTED

org.apache.kafka.connect.storage.OffsetStorageWriterTest > testWriteFlush PASSED

org.apache.kafka.connect.storage.OffsetStorageWriterTest > testWriteNullValueFlush STARTED

org.apache.kafka.connect.storage.OffsetStorageWriterTest > testWriteNullValueFlush PASSED

org.apache.kafka.connect.storage.OffsetStorageWriterTest > testWriteNullKeyFlush STARTED

org.apache.kafka.connect.storage.OffsetStorageWriterTest > testWriteNullKeyFlush PASSED

org.apache.kafka.connect.storage.KafkaStatusBackingStoreTest > readTaskState STARTED

org.apache.kafka.connect.storage.KafkaStatusBackingStoreTest > readTaskState PASSED

org.apache.kafka.connect.storage.KafkaStatusBackingStoreTest > putTaskState STARTED

org.apache.kafka.connect.storage.KafkaStatusBackingStoreTest > putTaskState PASSED

org.apache.kafka.connect.storage.KafkaStatusBackingStoreTest > putSafeWithNoPreviousValueIsPropagated
STARTED

org.apache.kafka.connect.storage.KafkaStatusBackingStoreTest > putSafeWithNoPreviousValueIsPropagated
PASSED

org.apache.kafka.connect.storage.KafkaStatusBackingStoreTest > putConnectorStateNonRetriableFailure
STARTED

org.apache.kafka.connect.storage.KafkaStatusBackingStoreTest > putConnectorStateNonRetriableFailure
PASSED

org.apache.kafka.connect.storage.KafkaStatusBackingStoreTest > putConnectorStateShouldOverride
STARTED

org.apache.kafka.connect.storage.KafkaStatusBackingStoreTest > putConnectorStateShouldOverride
PASSED

org.apache.kafka.connect.storage.KafkaStatusBackingStoreTest > putConnectorStateRetriableFailure
STARTED

org.apache.kafka.connect.storage.KafkaStatusBackingStoreTest > putConnectorStateRetriableFailure
PASSED

org.apache.kafka.connect.storage.KafkaStatusBackingStoreTest > putSafeOverridesValueSetBySameWorker
STARTED

org.apache.kafka.connect.storage.KafkaStatusBackingStoreTest > putSafeOverridesValueSetBySameWorker
PASSED

org.apache.kafka.connect.storage.KafkaStatusBackingStoreTest > readConnectorState STARTED

org.apache.kafka.connect.storage.KafkaStatusBackingStoreTest > readConnectorState PASSED

org.apache.kafka.connect.storage.KafkaStatusBackingStoreTest > putSafeConnectorIgnoresStaleStatus
STARTED

org.apache.kafka.connect.storage.KafkaStatusBackingStoreTest > putSafeConnectorIgnoresStaleStatus
PASSED

org.apache.kafka.connect.storage.KafkaStatusBackingStoreTest > putConnectorState STARTED

org.apache.kafka.connect.storage.KafkaStatusBackingStoreTest > putConnectorState PASSED

org.apache.kafka.connect.storage.KafkaOffsetBackingStoreTest > testStartStop STARTED

org.apache.kafka.connect.storage.KafkaOffsetBackingStoreTest > testStartStop PASSED

org.apache.kafka.connect.storage.KafkaOffsetBackingStoreTest > testReloadOnStart STARTED

org.apache.kafka.connect.storage.KafkaOffsetBackingStoreTest > testReloadOnStart PASSED

org.apache.kafka.connect.storage.KafkaOffsetBackingStoreTest > testGetSet STARTED

org.apache.kafka.connect.storage.KafkaOffsetBackingStoreTest > testGetSet PASSED

org.apache.kafka.connect.storage.KafkaOffsetBackingStoreTest > testGetSetNull STARTED

org.apache.kafka.connect.storage.KafkaOffsetBackingStoreTest > testGetSetNull PASSED

org.apache.kafka.connect.storage.KafkaOffsetBackingStoreTest > testSetFailure STARTED

org.apache.kafka.connect.storage.KafkaOffsetBackingStoreTest > testSetFailure PASSED

org.apache.kafka.connect.storage.FileOffsetBackingStoreTest > testSaveRestore STARTED

org.apache.kafka.connect.storage.FileOffsetBackingStoreTest > testSaveRestore PASSED

org.apache.kafka.connect.storage.FileOffsetBackingStoreTest > testGetSet STARTED

org.apache.kafka.connect.storage.FileOffsetBackingStoreTest > testGetSet PASSED

org.apache.kafka.connect.storage.MemoryStatusBackingStoreTest > putAndGetConnectorStatus
STARTED

org.apache.kafka.connect.storage.MemoryStatusBackingStoreTest > putAndGetConnectorStatus
PASSED

org.apache.kafka.connect.storage.MemoryStatusBackingStoreTest > putAndGetTaskStatus STARTED

org.apache.kafka.connect.storage.MemoryStatusBackingStoreTest > putAndGetTaskStatus PASSED

org.apache.kafka.connect.storage.MemoryStatusBackingStoreTest > deleteTaskStatus STARTED

org.apache.kafka.connect.storage.MemoryStatusBackingStoreTest > deleteTaskStatus PASSED

org.apache.kafka.connect.storage.MemoryStatusBackingStoreTest > deleteConnectorStatus STARTED

org.apache.kafka.connect.storage.MemoryStatusBackingStoreTest > deleteConnectorStatus PASSED

org.apache.kafka.connect.storage.KafkaConfigBackingStoreTest > testStartStop STARTED

org.apache.kafka.connect.storage.KafkaConfigBackingStoreTest > testStartStop PASSED

org.apache.kafka.connect.storage.KafkaConfigBackingStoreTest > testPutConnectorConfig STARTED

org.apache.kafka.connect.storage.KafkaConfigBackingStoreTest > testPutConnectorConfig PASSED

org.apache.kafka.connect.storage.KafkaConfigBackingStoreTest > testPutTaskConfigsZeroTasks
STARTED

org.apache.kafka.connect.storage.KafkaConfigBackingStoreTest > testPutTaskConfigsZeroTasks
PASSED

org.apache.kafka.connect.storage.KafkaConfigBackingStoreTest > testRestoreTargetState STARTED

org.apache.kafka.connect.storage.KafkaConfigBackingStoreTest > testRestoreTargetState PASSED

org.apache.kafka.connect.storage.KafkaConfigBackingStoreTest > testBackgroundUpdateTargetState
STARTED

org.apache.kafka.connect.storage.KafkaConfigBackingStoreTest > testBackgroundUpdateTargetState
PASSED

org.apache.kafka.connect.storage.KafkaConfigBackingStoreTest > testBackgroundConnectorDeletion
STARTED

org.apache.kafka.connect.storage.KafkaConfigBackingStoreTest > testBackgroundConnectorDeletion
PASSED

org.apache.kafka.connect.storage.KafkaConfigBackingStoreTest > testRestoreTargetStateUnexpectedDeletion
STARTED

org.apache.kafka.connect.storage.KafkaConfigBackingStoreTest > testRestoreTargetStateUnexpectedDeletion
PASSED

org.apache.kafka.connect.storage.KafkaConfigBackingStoreTest > testRestore STARTED

org.apache.kafka.connect.storage.KafkaConfigBackingStoreTest > testRestore PASSED

org.apache.kafka.connect.storage.KafkaConfigBackingStoreTest > testRestoreConnectorDeletion
STARTED

org.apache.kafka.connect.storage.KafkaConfigBackingStoreTest > testRestoreConnectorDeletion
PASSED

org.apache.kafka.connect.storage.KafkaConfigBackingStoreTest > testRestoreZeroTasks STARTED

org.apache.kafka.connect.storage.KafkaConfigBackingStoreTest > testRestoreZeroTasks PASSED

org.apache.kafka.connect.storage.KafkaConfigBackingStoreTest > testPutTaskConfigsDoesNotResolveAllInconsistencies
STARTED

org.apache.kafka.connect.storage.KafkaConfigBackingStoreTest > testPutTaskConfigsDoesNotResolveAllInconsistencies
PASSED

org.apache.kafka.connect.storage.KafkaConfigBackingStoreTest > testPutTaskConfigs STARTED

org.apache.kafka.connect.storage.KafkaConfigBackingStoreTest > testPutTaskConfigs PASSED

246 tests completed, 1 failed
:connect:runtime:test FAILED

FAILURE: Build failed with an exception.

* What went wrong:
Execution failed for task ':connect:runtime:test'.
> There were failing tests. See the report at: file://<https://builds.apache.org/job/kafka-trunk-jdk7/ws/connect/runtime/build/reports/tests/test/index.html>

* Try:
Run with --stacktrace option to get the stack trace. Run with --info or --debug option to
get more log output.

BUILD FAILED

Total time: 1 hrs 5 mins 24.461 secs
Build step 'Execute shell' marked build as failure
[FINDBUGS] Collecting findbugs analysis files...
Setting GRADLE_3_4_RC_2_HOME=/home/jenkins/jenkins-slave/tools/hudson.plugins.gradle.GradleInstallation/Gradle_3.4-rc-2
[FINDBUGS] Searching for all files in <https://builds.apache.org/job/kafka-trunk-jdk7/ws/>
that match the pattern **/build/reports/findbugs/*.xml
[FINDBUGS] Parsing 10 files in <https://builds.apache.org/job/kafka-trunk-jdk7/ws/>
[FINDBUGS] Successfully parsed file <https://builds.apache.org/job/kafka-trunk-jdk7/ws/clients/build/reports/findbugs/main.xml>
with 0 unique warnings and 0 duplicates.
[FINDBUGS] Successfully parsed file <https://builds.apache.org/job/kafka-trunk-jdk7/ws/connect/api/build/reports/findbugs/main.xml>
with 0 unique warnings and 0 duplicates.
[FINDBUGS] Successfully parsed file <https://builds.apache.org/job/kafka-trunk-jdk7/ws/connect/file/build/reports/findbugs/main.xml>
with 0 unique warnings and 0 duplicates.
[FINDBUGS] Successfully parsed file <https://builds.apache.org/job/kafka-trunk-jdk7/ws/connect/json/build/reports/findbugs/main.xml>
with 0 unique warnings and 0 duplicates.
[FINDBUGS] Successfully parsed file <https://builds.apache.org/job/kafka-trunk-jdk7/ws/connect/runtime/build/reports/findbugs/main.xml>
with 0 unique warnings and 0 duplicates.
[FINDBUGS] Successfully parsed file <https://builds.apache.org/job/kafka-trunk-jdk7/ws/core/build/reports/findbugs/main.xml>
with 0 unique warnings and 0 duplicates.
[FINDBUGS] Successfully parsed file <https://builds.apache.org/job/kafka-trunk-jdk7/ws/examples/build/reports/findbugs/main.xml>
with 0 unique warnings and 0 duplicates.
[FINDBUGS] Successfully parsed file <https://builds.apache.org/job/kafka-trunk-jdk7/ws/log4j-appender/build/reports/findbugs/main.xml>
with 0 unique warnings and 0 duplicates.
[FINDBUGS] Successfully parsed file <https://builds.apache.org/job/kafka-trunk-jdk7/ws/streams/build/reports/findbugs/main.xml>
with 0 unique warnings and 0 duplicates.
[FINDBUGS] Successfully parsed file <https://builds.apache.org/job/kafka-trunk-jdk7/ws/tools/build/reports/findbugs/main.xml>
with 0 unique warnings and 0 duplicates.
[FINDBUGS] Computing warning deltas based on reference build #2454
Recording test results
Setting GRADLE_3_4_RC_2_HOME=/home/jenkins/jenkins-slave/tools/hudson.plugins.gradle.GradleInstallation/Gradle_3.4-rc-2
Setting GRADLE_3_4_RC_2_HOME=/home/jenkins/jenkins-slave/tools/hudson.plugins.gradle.GradleInstallation/Gradle_3.4-rc-2
Not sending mail to unregistered user damian.guy@gmail.com

Mime
View raw message