kafka-dev mailing list archives

Site index · List index
Message view « Date » · « Thread »
Top « Date » · « Thread »
From Apache Jenkins Server <jenk...@builds.apache.org>
Subject Build failed in Jenkins: kafka-0.11.0-jdk7 #50
Date Wed, 31 May 2017 00:38:29 GMT
See <https://builds.apache.org/job/kafka-0.11.0-jdk7/50/display/redirect?page=changes>

Changes:

[junrao] MINOR: Fix doc for producer throttle time metrics

------------------------------------------
[...truncated 906.15 KB...]

kafka.controller.ControllerEventManagerTest > testSuccessfulEvent PASSED

kafka.controller.ControllerIntegrationTest > testPartitionReassignmentWithOfflineReplicaHaltingProgress
STARTED

kafka.controller.ControllerIntegrationTest > testPartitionReassignmentWithOfflineReplicaHaltingProgress
PASSED

kafka.controller.ControllerIntegrationTest > testControllerEpochPersistsWhenAllBrokersDown
STARTED

kafka.controller.ControllerIntegrationTest > testControllerEpochPersistsWhenAllBrokersDown
PASSED

kafka.controller.ControllerIntegrationTest > testTopicCreationWithOfflineReplica STARTED

kafka.controller.ControllerIntegrationTest > testTopicCreationWithOfflineReplica PASSED

kafka.controller.ControllerIntegrationTest > testPartitionReassignmentResumesAfterReplicaComesOnline
STARTED

kafka.controller.ControllerIntegrationTest > testPartitionReassignmentResumesAfterReplicaComesOnline
PASSED

kafka.controller.ControllerIntegrationTest > testLeaderAndIsrWhenEntireIsrOfflineAndUncleanLeaderElectionDisabled
STARTED

kafka.controller.ControllerIntegrationTest > testLeaderAndIsrWhenEntireIsrOfflineAndUncleanLeaderElectionDisabled
PASSED

kafka.controller.ControllerIntegrationTest > testTopicPartitionExpansionWithOfflineReplica
STARTED

kafka.controller.ControllerIntegrationTest > testTopicPartitionExpansionWithOfflineReplica
PASSED

kafka.controller.ControllerIntegrationTest > testPreferredReplicaLeaderElectionWithOfflinePreferredReplica
STARTED

kafka.controller.ControllerIntegrationTest > testPreferredReplicaLeaderElectionWithOfflinePreferredReplica
PASSED

kafka.controller.ControllerIntegrationTest > testAutoPreferredReplicaLeaderElection STARTED

kafka.controller.ControllerIntegrationTest > testAutoPreferredReplicaLeaderElection PASSED

kafka.controller.ControllerIntegrationTest > testTopicCreation STARTED

kafka.controller.ControllerIntegrationTest > testTopicCreation PASSED

kafka.controller.ControllerIntegrationTest > testPartitionReassignment STARTED

kafka.controller.ControllerIntegrationTest > testPartitionReassignment PASSED

kafka.controller.ControllerIntegrationTest > testTopicPartitionExpansion STARTED

kafka.controller.ControllerIntegrationTest > testTopicPartitionExpansion PASSED

kafka.controller.ControllerIntegrationTest > testControllerMoveIncrementsControllerEpoch
STARTED

kafka.controller.ControllerIntegrationTest > testControllerMoveIncrementsControllerEpoch
PASSED

kafka.controller.ControllerIntegrationTest > testLeaderAndIsrWhenEntireIsrOfflineAndUncleanLeaderElectionEnabled
STARTED

kafka.controller.ControllerIntegrationTest > testLeaderAndIsrWhenEntireIsrOfflineAndUncleanLeaderElectionEnabled
PASSED

kafka.controller.ControllerIntegrationTest > testEmptyCluster STARTED

kafka.controller.ControllerIntegrationTest > testEmptyCluster PASSED

kafka.controller.ControllerIntegrationTest > testPreferredReplicaLeaderElection STARTED

kafka.controller.ControllerIntegrationTest > testPreferredReplicaLeaderElection PASSED

kafka.controller.ControllerFailoverTest > testMetadataUpdate STARTED

kafka.controller.ControllerFailoverTest > testMetadataUpdate SKIPPED

kafka.tools.ConsoleProducerTest > testParseKeyProp STARTED

kafka.tools.ConsoleProducerTest > testParseKeyProp PASSED

kafka.tools.ConsoleProducerTest > testValidConfigsOldProducer STARTED

kafka.tools.ConsoleProducerTest > testValidConfigsOldProducer PASSED

kafka.tools.ConsoleProducerTest > testInvalidConfigs STARTED

kafka.tools.ConsoleProducerTest > testInvalidConfigs PASSED

kafka.tools.ConsoleProducerTest > testValidConfigsNewProducer STARTED

kafka.tools.ConsoleProducerTest > testValidConfigsNewProducer PASSED

kafka.tools.ConsoleConsumerTest > shouldLimitReadsToMaxMessageLimit STARTED

kafka.tools.ConsoleConsumerTest > shouldLimitReadsToMaxMessageLimit PASSED

kafka.tools.ConsoleConsumerTest > shouldParseValidNewConsumerValidConfig STARTED

kafka.tools.ConsoleConsumerTest > shouldParseValidNewConsumerValidConfig PASSED

kafka.tools.ConsoleConsumerTest > shouldStopWhenOutputCheckErrorFails STARTED

kafka.tools.ConsoleConsumerTest > shouldStopWhenOutputCheckErrorFails PASSED

kafka.tools.ConsoleConsumerTest > shouldParseValidNewSimpleConsumerValidConfigWithStringOffset
STARTED

kafka.tools.ConsoleConsumerTest > shouldParseValidNewSimpleConsumerValidConfigWithStringOffset
PASSED

kafka.tools.ConsoleConsumerTest > shouldParseConfigsFromFile STARTED

kafka.tools.ConsoleConsumerTest > shouldParseConfigsFromFile PASSED

kafka.tools.ConsoleConsumerTest > shouldParseValidNewSimpleConsumerValidConfigWithNumericOffset
STARTED

kafka.tools.ConsoleConsumerTest > shouldParseValidNewSimpleConsumerValidConfigWithNumericOffset
PASSED

kafka.tools.ConsoleConsumerTest > testDefaultConsumer STARTED

kafka.tools.ConsoleConsumerTest > testDefaultConsumer PASSED

kafka.tools.ConsoleConsumerTest > shouldParseValidOldConsumerValidConfig STARTED

kafka.tools.ConsoleConsumerTest > shouldParseValidOldConsumerValidConfig PASSED

kafka.tools.MirrorMakerTest > testDefaultMirrorMakerMessageHandlerWithNoTimestampInSourceMessage
STARTED

kafka.tools.MirrorMakerTest > testDefaultMirrorMakerMessageHandlerWithNoTimestampInSourceMessage
PASSED

kafka.tools.MirrorMakerTest > testDefaultMirrorMakerMessageHandler STARTED

kafka.tools.MirrorMakerTest > testDefaultMirrorMakerMessageHandler PASSED

kafka.tools.MirrorMakerIntegrationTest > testCommaSeparatedRegex STARTED

kafka.tools.MirrorMakerIntegrationTest > testCommaSeparatedRegex PASSED

kafka.tools.ReplicaVerificationToolTest > testReplicaBufferVerifyChecksum STARTED

kafka.tools.ReplicaVerificationToolTest > testReplicaBufferVerifyChecksum PASSED

unit.kafka.server.KafkaApisTest > shouldThrowUnsupportedVersionExceptionOnHandleTxnOffsetCommitRequestWhenInterBrokerProtocolNotSupported
STARTED

unit.kafka.server.KafkaApisTest > shouldThrowUnsupportedVersionExceptionOnHandleTxnOffsetCommitRequestWhenInterBrokerProtocolNotSupported
PASSED

unit.kafka.server.KafkaApisTest > shouldThrowUnsupportedVersionExceptionOnHandleAddPartitionsToTxnRequestWhenInterBrokerProtocolNotSupported
STARTED

unit.kafka.server.KafkaApisTest > shouldThrowUnsupportedVersionExceptionOnHandleAddPartitionsToTxnRequestWhenInterBrokerProtocolNotSupported
PASSED

unit.kafka.server.KafkaApisTest > shouldThrowUnsupportedVersionExceptionOnHandleWriteTxnMarkersRequestWhenInterBrokerProtocolNotSupported
STARTED

unit.kafka.server.KafkaApisTest > shouldThrowUnsupportedVersionExceptionOnHandleWriteTxnMarkersRequestWhenInterBrokerProtocolNotSupported
PASSED

unit.kafka.server.KafkaApisTest > shouldThrowUnsupportedVersionExceptionOnHandleAddOffsetToTxnRequestWhenInterBrokerProtocolNotSupported
STARTED

unit.kafka.server.KafkaApisTest > shouldThrowUnsupportedVersionExceptionOnHandleAddOffsetToTxnRequestWhenInterBrokerProtocolNotSupported
PASSED

unit.kafka.server.KafkaApisTest > shouldThrowUnsupportedVersionExceptionOnHandleEndTxnRequestWhenInterBrokerProtocolNotSupported
STARTED

unit.kafka.server.KafkaApisTest > shouldThrowUnsupportedVersionExceptionOnHandleEndTxnRequestWhenInterBrokerProtocolNotSupported
PASSED

unit.kafka.admin.ResetConsumerGroupOffsetTest > testResetOffsetsShiftByHigherThanLatest
STARTED

unit.kafka.admin.ResetConsumerGroupOffsetTest > testResetOffsetsShiftByHigherThanLatest
PASSED

unit.kafka.admin.ResetConsumerGroupOffsetTest > testResetOffsetsShiftMinus STARTED

unit.kafka.admin.ResetConsumerGroupOffsetTest > testResetOffsetsShiftMinus PASSED

unit.kafka.admin.ResetConsumerGroupOffsetTest > testResetOffsetsToCurrentOffset STARTED

unit.kafka.admin.ResetConsumerGroupOffsetTest > testResetOffsetsToCurrentOffset PASSED

unit.kafka.admin.ResetConsumerGroupOffsetTest > testResetOffsetsToEarliestOnOneTopicAndPartition
STARTED

unit.kafka.admin.ResetConsumerGroupOffsetTest > testResetOffsetsToEarliestOnOneTopicAndPartition
PASSED

unit.kafka.admin.ResetConsumerGroupOffsetTest > testResetOffsetsByDurationToEarliest STARTED

unit.kafka.admin.ResetConsumerGroupOffsetTest > testResetOffsetsByDurationToEarliest PASSED

unit.kafka.admin.ResetConsumerGroupOffsetTest > testResetOffsetsToEarliestOnOneTopic STARTED

unit.kafka.admin.ResetConsumerGroupOffsetTest > testResetOffsetsToEarliestOnOneTopic PASSED

unit.kafka.admin.ResetConsumerGroupOffsetTest > testResetOffsetsNotExistingGroup STARTED

unit.kafka.admin.ResetConsumerGroupOffsetTest > testResetOffsetsNotExistingGroup PASSED

unit.kafka.admin.ResetConsumerGroupOffsetTest > testResetOffsetsToZonedDateTime STARTED

unit.kafka.admin.ResetConsumerGroupOffsetTest > testResetOffsetsToZonedDateTime PASSED

unit.kafka.admin.ResetConsumerGroupOffsetTest > testResetOffsetsToEarliest STARTED

unit.kafka.admin.ResetConsumerGroupOffsetTest > testResetOffsetsToEarliest PASSED

unit.kafka.admin.ResetConsumerGroupOffsetTest > testResetOffsetsExportImportPlan STARTED

unit.kafka.admin.ResetConsumerGroupOffsetTest > testResetOffsetsExportImportPlan PASSED

unit.kafka.admin.ResetConsumerGroupOffsetTest > testResetOffsetsToSpecificOffset STARTED

unit.kafka.admin.ResetConsumerGroupOffsetTest > testResetOffsetsToSpecificOffset PASSED

unit.kafka.admin.ResetConsumerGroupOffsetTest > testResetOffsetsShiftPlus STARTED

unit.kafka.admin.ResetConsumerGroupOffsetTest > testResetOffsetsShiftPlus PASSED

unit.kafka.admin.ResetConsumerGroupOffsetTest > testResetOffsetsToLatest STARTED

unit.kafka.admin.ResetConsumerGroupOffsetTest > testResetOffsetsToLatest PASSED

unit.kafka.admin.ResetConsumerGroupOffsetTest > testResetOffsetsShiftByLowerThanEarliest
STARTED

unit.kafka.admin.ResetConsumerGroupOffsetTest > testResetOffsetsShiftByLowerThanEarliest
PASSED

unit.kafka.admin.ResetConsumerGroupOffsetTest > testResetOffsetsByDuration STARTED

unit.kafka.admin.ResetConsumerGroupOffsetTest > testResetOffsetsByDuration PASSED

unit.kafka.admin.ResetConsumerGroupOffsetTest > testResetOffsetsToLocalDateTime STARTED

unit.kafka.admin.ResetConsumerGroupOffsetTest > testResetOffsetsToLocalDateTime PASSED

unit.kafka.admin.ResetConsumerGroupOffsetTest > testResetOffsetsToEarliestOnTopicsAndPartitions
STARTED

unit.kafka.admin.ResetConsumerGroupOffsetTest > testResetOffsetsToEarliestOnTopicsAndPartitions
PASSED

unit.kafka.admin.ResetConsumerGroupOffsetTest > testResetOffsetsToEarliestOnTopics STARTED

unit.kafka.admin.ResetConsumerGroupOffsetTest > testResetOffsetsToEarliestOnTopics PASSED

1395 tests completed, 1 failed, 6 skipped
:kafka-0.11.0-jdk7:core:test FAILED
:test_core_2_11 FAILED

FAILURE: Build failed with an exception.

* What went wrong:
Execution failed for task ':kafka-0.11.0-jdk7:core:test'.
> There were failing tests. See the report at: file://<https://builds.apache.org/job/kafka-0.11.0-jdk7/ws/core/build/reports/tests/test/index.html>

* Try:
Run with --stacktrace option to get the stack trace. Run with --info or --debug option to
get more log output.

BUILD FAILED

Total time: 1 hrs 0 mins 52.423 secs
Build step 'Execute shell' marked build as failure
[FINDBUGS] Collecting findbugs analysis files...
Setting GRADLE_3_4_RC_2_HOME=/home/jenkins/jenkins-slave/tools/hudson.plugins.gradle.GradleInstallation/Gradle_3.4-rc-2
[FINDBUGS] Searching for all files in <https://builds.apache.org/job/kafka-0.11.0-jdk7/ws/>
that match the pattern **/build/reports/findbugs/*.xml
[FINDBUGS] Parsing 1 file in <https://builds.apache.org/job/kafka-0.11.0-jdk7/ws/>
[FINDBUGS] Successfully parsed file <https://builds.apache.org/job/kafka-0.11.0-jdk7/ws/core/build/reports/findbugs/main.xml>
with 0 unique warnings and 0 duplicates.
[FINDBUGS] Computing warning deltas based on reference build #49
Recording test results
Setting GRADLE_3_4_RC_2_HOME=/home/jenkins/jenkins-slave/tools/hudson.plugins.gradle.GradleInstallation/Gradle_3.4-rc-2
Setting GRADLE_3_4_RC_2_HOME=/home/jenkins/jenkins-slave/tools/hudson.plugins.gradle.GradleInstallation/Gradle_3.4-rc-2

Mime
View raw message