kafka-dev mailing list archives

Site index · List index
Message view « Date » · « Thread »
Top « Date » · « Thread »
From Apache Jenkins Server <jenk...@builds.apache.org>
Subject Build failed in Jenkins: kafka-trunk-jdk8 #1501
Date Thu, 11 May 2017 06:34:13 GMT
See <https://builds.apache.org/job/kafka-trunk-jdk8/1501/display/redirect?page=changes>

Changes:

[jason] KAFKA-5213; Mark a MemoryRecordsBuilder as full as soon as the append

------------------------------------------
[...truncated 3.57 MB...]

kafka.server.ReplicaFetcherThreadTest > shouldMovePartitionsOutOfTruncatingLogState PASSED

kafka.server.ReplicaFetcherThreadTest > shouldFilterPartitionsMadeLeaderDuringLeaderEpochRequest
STARTED

kafka.server.ReplicaFetcherThreadTest > shouldFilterPartitionsMadeLeaderDuringLeaderEpochRequest
PASSED

kafka.server.ReplicaManagerQuotasTest > shouldGetBothMessagesIfQuotasAllow STARTED

kafka.server.ReplicaManagerQuotasTest > shouldGetBothMessagesIfQuotasAllow PASSED

kafka.server.ReplicaManagerQuotasTest > shouldExcludeSubsequentThrottledPartitions STARTED

kafka.server.ReplicaManagerQuotasTest > shouldExcludeSubsequentThrottledPartitions PASSED

kafka.server.ReplicaManagerQuotasTest > shouldGetNoMessagesIfQuotasExceededOnSubsequentPartitions
STARTED

kafka.server.ReplicaManagerQuotasTest > shouldGetNoMessagesIfQuotasExceededOnSubsequentPartitions
PASSED

kafka.server.ReplicaManagerQuotasTest > shouldIncludeInSyncThrottledReplicas STARTED

kafka.server.ReplicaManagerQuotasTest > shouldIncludeInSyncThrottledReplicas PASSED

kafka.server.ServerGenerateClusterIdTest > testAutoGenerateClusterIdForKafkaClusterParallel
STARTED

kafka.server.ServerGenerateClusterIdTest > testAutoGenerateClusterIdForKafkaClusterParallel
PASSED

kafka.server.ServerGenerateClusterIdTest > testAutoGenerateClusterId STARTED

kafka.server.ServerGenerateClusterIdTest > testAutoGenerateClusterId PASSED

kafka.server.ServerGenerateClusterIdTest > testAutoGenerateClusterIdForKafkaClusterSequential
STARTED

kafka.server.ServerGenerateClusterIdTest > testAutoGenerateClusterIdForKafkaClusterSequential
PASSED

kafka.server.ServerShutdownTest > testCleanShutdownAfterFailedStartup STARTED

kafka.server.ServerShutdownTest > testCleanShutdownAfterFailedStartup PASSED

kafka.server.ServerShutdownTest > testConsecutiveShutdown STARTED

kafka.server.ServerShutdownTest > testConsecutiveShutdown PASSED

kafka.server.ServerShutdownTest > testCleanShutdown STARTED

kafka.server.ServerShutdownTest > testCleanShutdown PASSED

kafka.server.ServerShutdownTest > testCleanShutdownWithDeleteTopicEnabled STARTED

kafka.server.ServerShutdownTest > testCleanShutdownWithDeleteTopicEnabled PASSED

kafka.server.RequestQuotaTest > testUnauthorizedThrottle STARTED

kafka.server.RequestQuotaTest > testUnauthorizedThrottle PASSED

kafka.server.RequestQuotaTest > testUnthrottledClient STARTED

kafka.server.RequestQuotaTest > testUnthrottledClient PASSED

kafka.server.RequestQuotaTest > testExemptRequestTime STARTED

kafka.server.RequestQuotaTest > testExemptRequestTime PASSED

kafka.server.RequestQuotaTest > testResponseThrottleTime STARTED

kafka.server.RequestQuotaTest > testResponseThrottleTime PASSED

kafka.server.ServerStartupTest > testBrokerStateRunningAfterZK STARTED

kafka.server.ServerStartupTest > testBrokerStateRunningAfterZK PASSED

kafka.server.ServerStartupTest > testBrokerCreatesZKChroot STARTED

kafka.server.ServerStartupTest > testBrokerCreatesZKChroot PASSED

kafka.server.ServerStartupTest > testConflictBrokerStartupWithSamePort STARTED

kafka.server.ServerStartupTest > testConflictBrokerStartupWithSamePort PASSED

kafka.server.ServerStartupTest > testConflictBrokerRegistration STARTED

kafka.server.ServerStartupTest > testConflictBrokerRegistration PASSED

kafka.server.ServerStartupTest > testBrokerSelfAware STARTED

kafka.server.ServerStartupTest > testBrokerSelfAware PASSED

kafka.server.ServerGenerateBrokerIdTest > testGetSequenceIdMethod STARTED

kafka.server.ServerGenerateBrokerIdTest > testGetSequenceIdMethod PASSED

kafka.server.ServerGenerateBrokerIdTest > testBrokerMetadataOnIdCollision STARTED

kafka.server.ServerGenerateBrokerIdTest > testBrokerMetadataOnIdCollision PASSED

kafka.server.ServerGenerateBrokerIdTest > testAutoGenerateBrokerId STARTED

kafka.server.ServerGenerateBrokerIdTest > testAutoGenerateBrokerId PASSED

kafka.server.ServerGenerateBrokerIdTest > testMultipleLogDirsMetaProps STARTED

kafka.server.ServerGenerateBrokerIdTest > testMultipleLogDirsMetaProps PASSED

kafka.server.ServerGenerateBrokerIdTest > testDisableGeneratedBrokerId STARTED

kafka.server.ServerGenerateBrokerIdTest > testDisableGeneratedBrokerId PASSED

kafka.server.ServerGenerateBrokerIdTest > testUserConfigAndGeneratedBrokerId STARTED

kafka.server.ServerGenerateBrokerIdTest > testUserConfigAndGeneratedBrokerId PASSED

kafka.server.ServerGenerateBrokerIdTest > testConsistentBrokerIdFromUserConfigAndMetaProps
STARTED

kafka.server.ServerGenerateBrokerIdTest > testConsistentBrokerIdFromUserConfigAndMetaProps
PASSED

kafka.server.ReplicationQuotasTest > shouldBootstrapTwoBrokersWithLeaderThrottle STARTED

kafka.server.ReplicationQuotasTest > shouldBootstrapTwoBrokersWithLeaderThrottle PASSED

kafka.server.ReplicationQuotasTest > shouldThrottleOldSegments STARTED

kafka.server.ReplicationQuotasTest > shouldThrottleOldSegments PASSED

kafka.server.ReplicationQuotasTest > shouldBootstrapTwoBrokersWithFollowerThrottle STARTED

kafka.server.ReplicationQuotasTest > shouldBootstrapTwoBrokersWithFollowerThrottle PASSED

kafka.controller.ControllerFailoverTest > testMetadataUpdate STARTED

kafka.controller.ControllerFailoverTest > testMetadataUpdate SKIPPED

kafka.controller.ControllerIntegrationTest > testPartitionReassignmentWithOfflineReplicaHaltingProgress
STARTED

kafka.controller.ControllerIntegrationTest > testPartitionReassignmentWithOfflineReplicaHaltingProgress
PASSED

kafka.controller.ControllerIntegrationTest > testControllerEpochPersistsWhenAllBrokersDown
STARTED

kafka.controller.ControllerIntegrationTest > testControllerEpochPersistsWhenAllBrokersDown
PASSED

kafka.controller.ControllerIntegrationTest > testTopicCreationWithOfflineReplica STARTED

kafka.controller.ControllerIntegrationTest > testTopicCreationWithOfflineReplica PASSED

kafka.controller.ControllerIntegrationTest > testPartitionReassignmentResumesAfterReplicaComesOnline
STARTED

kafka.controller.ControllerIntegrationTest > testPartitionReassignmentResumesAfterReplicaComesOnline
PASSED

kafka.controller.ControllerIntegrationTest > testLeaderAndIsrWhenEntireIsrOfflineAndUncleanLeaderElectionDisabled
STARTED

kafka.controller.ControllerIntegrationTest > testLeaderAndIsrWhenEntireIsrOfflineAndUncleanLeaderElectionDisabled
PASSED

kafka.controller.ControllerIntegrationTest > testTopicPartitionExpansionWithOfflineReplica
STARTED

kafka.controller.ControllerIntegrationTest > testTopicPartitionExpansionWithOfflineReplica
PASSED

kafka.controller.ControllerIntegrationTest > testPreferredReplicaLeaderElectionWithOfflinePreferredReplica
STARTED

kafka.controller.ControllerIntegrationTest > testPreferredReplicaLeaderElectionWithOfflinePreferredReplica
PASSED

kafka.controller.ControllerIntegrationTest > testAutoPreferredReplicaLeaderElection STARTED

kafka.controller.ControllerIntegrationTest > testAutoPreferredReplicaLeaderElection PASSED

kafka.controller.ControllerIntegrationTest > testTopicCreation STARTED

kafka.controller.ControllerIntegrationTest > testTopicCreation PASSED

kafka.controller.ControllerIntegrationTest > testPartitionReassignment STARTED

kafka.controller.ControllerIntegrationTest > testPartitionReassignment PASSED

kafka.controller.ControllerIntegrationTest > testTopicPartitionExpansion STARTED

kafka.controller.ControllerIntegrationTest > testTopicPartitionExpansion PASSED

kafka.controller.ControllerIntegrationTest > testControllerMoveIncrementsControllerEpoch
STARTED

kafka.controller.ControllerIntegrationTest > testControllerMoveIncrementsControllerEpoch
PASSED

kafka.controller.ControllerIntegrationTest > testLeaderAndIsrWhenEntireIsrOfflineAndUncleanLeaderElectionEnabled
STARTED

kafka.controller.ControllerIntegrationTest > testLeaderAndIsrWhenEntireIsrOfflineAndUncleanLeaderElectionEnabled
PASSED

kafka.controller.ControllerIntegrationTest > testEmptyCluster STARTED

kafka.controller.ControllerIntegrationTest > testEmptyCluster PASSED

kafka.controller.ControllerIntegrationTest > testPreferredReplicaLeaderElection STARTED

kafka.controller.ControllerIntegrationTest > testPreferredReplicaLeaderElection PASSED

kafka.javaapi.consumer.ZookeeperConsumerConnectorTest > testBasic STARTED

kafka.javaapi.consumer.ZookeeperConsumerConnectorTest > testBasic PASSED

kafka.javaapi.message.ByteBufferMessageSetTest > testSizeInBytesWithCompression STARTED

kafka.javaapi.message.ByteBufferMessageSetTest > testSizeInBytesWithCompression PASSED

kafka.javaapi.message.ByteBufferMessageSetTest > testIteratorIsConsistentWithCompression
STARTED

kafka.javaapi.message.ByteBufferMessageSetTest > testIteratorIsConsistentWithCompression
PASSED

kafka.javaapi.message.ByteBufferMessageSetTest > testIteratorIsConsistent STARTED

kafka.javaapi.message.ByteBufferMessageSetTest > testIteratorIsConsistent PASSED

kafka.javaapi.message.ByteBufferMessageSetTest > testEqualsWithCompression STARTED

kafka.javaapi.message.ByteBufferMessageSetTest > testEqualsWithCompression PASSED

kafka.javaapi.message.ByteBufferMessageSetTest > testWrittenEqualsRead STARTED

kafka.javaapi.message.ByteBufferMessageSetTest > testWrittenEqualsRead PASSED

kafka.javaapi.message.ByteBufferMessageSetTest > testEquals STARTED

kafka.javaapi.message.ByteBufferMessageSetTest > testEquals PASSED

kafka.javaapi.message.ByteBufferMessageSetTest > testSizeInBytes STARTED

kafka.javaapi.message.ByteBufferMessageSetTest > testSizeInBytes PASSED

1312 tests completed, 1 failed, 3 skipped
:core:test FAILED

FAILURE: Build failed with an exception.

* What went wrong:
Execution failed for task ':core:test'.
> There were failing tests. See the report at: file://<https://builds.apache.org/job/kafka-trunk-jdk8/ws/core/build/reports/tests/test/index.html>

* Try:
Run with --stacktrace option to get the stack trace. Run with --info or --debug option to
get more log output.

BUILD FAILED

Total time: 50 mins 33.094 secs
Build step 'Execute shell' marked build as failure
[FINDBUGS] Collecting findbugs analysis files...
Setting GRADLE_3_4_RC_2_HOME=/home/jenkins/jenkins-slave/tools/hudson.plugins.gradle.GradleInstallation/Gradle_3.4-rc-2
[FINDBUGS] Searching for all files in <https://builds.apache.org/job/kafka-trunk-jdk8/ws/>
that match the pattern **/build/reports/findbugs/*.xml
[FINDBUGS] Parsing 2 files in <https://builds.apache.org/job/kafka-trunk-jdk8/ws/>
[FINDBUGS] Successfully parsed file <https://builds.apache.org/job/kafka-trunk-jdk8/ws/clients/build/reports/findbugs/main.xml>
with 0 unique warnings and 0 duplicates.
[FINDBUGS] Successfully parsed file <https://builds.apache.org/job/kafka-trunk-jdk8/ws/core/build/reports/findbugs/main.xml>
with 0 unique warnings and 0 duplicates.
[FINDBUGS] Computing warning deltas based on reference build #1500
Recording test results
Setting GRADLE_3_4_RC_2_HOME=/home/jenkins/jenkins-slave/tools/hudson.plugins.gradle.GradleInstallation/Gradle_3.4-rc-2
Setting GRADLE_3_4_RC_2_HOME=/home/jenkins/jenkins-slave/tools/hudson.plugins.gradle.GradleInstallation/Gradle_3.4-rc-2

Mime
View raw message