kafka-dev mailing list archives

Site index · List index
Message view « Date » · « Thread »
Top « Date » · « Thread »
From Apache Jenkins Server <jenk...@builds.apache.org>
Subject Build failed in Jenkins: kafka-trunk-jdk8 #1490
Date Mon, 08 May 2017 06:21:41 GMT
See <https://builds.apache.org/job/kafka-trunk-jdk8/1490/display/redirect?page=changes>

Changes:

[wangguoz] KAFKA-5172: Fix fetchPrevious to find the correct session

------------------------------------------
[...truncated 857.71 KB...]
kafka.integration.SaslPlaintextTopicMetadataTest > testAliveBrokerListWithNoTopics STARTED

kafka.integration.SaslPlaintextTopicMetadataTest > testAliveBrokerListWithNoTopics PASSED

kafka.integration.SaslPlaintextTopicMetadataTest > testAutoCreateTopic STARTED

kafka.integration.SaslPlaintextTopicMetadataTest > testAutoCreateTopic PASSED

kafka.integration.SaslPlaintextTopicMetadataTest > testGetAllTopicMetadata STARTED

kafka.integration.SaslPlaintextTopicMetadataTest > testGetAllTopicMetadata PASSED

kafka.integration.SaslPlaintextTopicMetadataTest > testAliveBrokersListWithNoTopicsAfterNewBrokerStartup
STARTED

kafka.integration.SaslPlaintextTopicMetadataTest > testAliveBrokersListWithNoTopicsAfterNewBrokerStartup
PASSED

kafka.integration.SaslPlaintextTopicMetadataTest > testBasicTopicMetadata STARTED

kafka.integration.SaslPlaintextTopicMetadataTest > testBasicTopicMetadata PASSED

kafka.integration.SaslPlaintextTopicMetadataTest > testAutoCreateTopicWithInvalidReplication
STARTED

kafka.integration.SaslPlaintextTopicMetadataTest > testAutoCreateTopicWithInvalidReplication
PASSED

kafka.integration.SaslPlaintextTopicMetadataTest > testAliveBrokersListWithNoTopicsAfterABrokerShutdown
STARTED

kafka.integration.SaslPlaintextTopicMetadataTest > testAliveBrokersListWithNoTopicsAfterABrokerShutdown
PASSED

kafka.integration.PrimitiveApiTest > testMultiProduce STARTED

kafka.integration.PrimitiveApiTest > testMultiProduce PASSED

kafka.integration.PrimitiveApiTest > testDefaultEncoderProducerAndFetch STARTED

kafka.integration.PrimitiveApiTest > testDefaultEncoderProducerAndFetch PASSED

kafka.integration.PrimitiveApiTest > testFetchRequestCanProperlySerialize STARTED

kafka.integration.PrimitiveApiTest > testFetchRequestCanProperlySerialize PASSED

kafka.integration.PrimitiveApiTest > testPipelinedProduceRequests STARTED

kafka.integration.PrimitiveApiTest > testPipelinedProduceRequests PASSED

kafka.integration.PrimitiveApiTest > testProduceAndMultiFetch STARTED

kafka.integration.PrimitiveApiTest > testProduceAndMultiFetch PASSED

kafka.integration.PrimitiveApiTest > testDefaultEncoderProducerAndFetchWithCompression
STARTED

kafka.integration.PrimitiveApiTest > testDefaultEncoderProducerAndFetchWithCompression
PASSED

kafka.integration.PrimitiveApiTest > testConsumerEmptyTopic STARTED

kafka.integration.PrimitiveApiTest > testConsumerEmptyTopic PASSED

kafka.integration.PrimitiveApiTest > testEmptyFetchRequest STARTED

kafka.integration.PrimitiveApiTest > testEmptyFetchRequest PASSED

kafka.integration.PlaintextTopicMetadataTest > testIsrAfterBrokerShutDownAndJoinsBack STARTED

kafka.integration.PlaintextTopicMetadataTest > testIsrAfterBrokerShutDownAndJoinsBack PASSED

kafka.integration.PlaintextTopicMetadataTest > testAutoCreateTopicWithCollision STARTED

kafka.integration.PlaintextTopicMetadataTest > testAutoCreateTopicWithCollision PASSED

kafka.integration.PlaintextTopicMetadataTest > testAliveBrokerListWithNoTopics STARTED

kafka.integration.PlaintextTopicMetadataTest > testAliveBrokerListWithNoTopics PASSED

kafka.integration.PlaintextTopicMetadataTest > testAutoCreateTopic STARTED

kafka.integration.PlaintextTopicMetadataTest > testAutoCreateTopic PASSED

kafka.integration.PlaintextTopicMetadataTest > testGetAllTopicMetadata STARTED

kafka.integration.PlaintextTopicMetadataTest > testGetAllTopicMetadata PASSED

kafka.integration.PlaintextTopicMetadataTest > testAliveBrokersListWithNoTopicsAfterNewBrokerStartup
STARTED

kafka.integration.PlaintextTopicMetadataTest > testAliveBrokersListWithNoTopicsAfterNewBrokerStartup
PASSED

kafka.integration.PlaintextTopicMetadataTest > testBasicTopicMetadata STARTED

kafka.integration.PlaintextTopicMetadataTest > testBasicTopicMetadata PASSED

kafka.integration.PlaintextTopicMetadataTest > testAutoCreateTopicWithInvalidReplication
STARTED

kafka.integration.PlaintextTopicMetadataTest > testAutoCreateTopicWithInvalidReplication
PASSED

kafka.integration.PlaintextTopicMetadataTest > testAliveBrokersListWithNoTopicsAfterABrokerShutdown
STARTED

kafka.integration.PlaintextTopicMetadataTest > testAliveBrokersListWithNoTopicsAfterABrokerShutdown
PASSED

kafka.integration.MetricsDuringTopicCreationDeletionTest > testMetricsDuringTopicCreateDelete
STARTED

kafka.integration.MetricsDuringTopicCreationDeletionTest > testMetricsDuringTopicCreateDelete
PASSED

kafka.integration.AutoOffsetResetTest > testResetToLatestWhenOffsetTooLow STARTED

kafka.integration.AutoOffsetResetTest > testResetToLatestWhenOffsetTooLow PASSED

kafka.integration.AutoOffsetResetTest > testResetToEarliestWhenOffsetTooLow STARTED

kafka.integration.AutoOffsetResetTest > testResetToEarliestWhenOffsetTooLow PASSED

kafka.integration.AutoOffsetResetTest > testResetToEarliestWhenOffsetTooHigh STARTED

kafka.integration.AutoOffsetResetTest > testResetToEarliestWhenOffsetTooHigh PASSED

kafka.integration.AutoOffsetResetTest > testResetToLatestWhenOffsetTooHigh STARTED

kafka.integration.AutoOffsetResetTest > testResetToLatestWhenOffsetTooHigh PASSED

kafka.integration.SslTopicMetadataTest > testIsrAfterBrokerShutDownAndJoinsBack STARTED

kafka.integration.SslTopicMetadataTest > testIsrAfterBrokerShutDownAndJoinsBack PASSED

kafka.integration.SslTopicMetadataTest > testAutoCreateTopicWithCollision STARTED

kafka.integration.SslTopicMetadataTest > testAutoCreateTopicWithCollision PASSED

kafka.integration.SslTopicMetadataTest > testAliveBrokerListWithNoTopics STARTED

kafka.integration.SslTopicMetadataTest > testAliveBrokerListWithNoTopics PASSED

kafka.integration.SslTopicMetadataTest > testAutoCreateTopic STARTED

kafka.integration.SslTopicMetadataTest > testAutoCreateTopic PASSED

kafka.integration.SslTopicMetadataTest > testGetAllTopicMetadata STARTED

kafka.integration.SslTopicMetadataTest > testGetAllTopicMetadata PASSED

kafka.integration.SslTopicMetadataTest > testAliveBrokersListWithNoTopicsAfterNewBrokerStartup
STARTED

kafka.integration.SslTopicMetadataTest > testAliveBrokersListWithNoTopicsAfterNewBrokerStartup
PASSED

kafka.integration.SslTopicMetadataTest > testBasicTopicMetadata STARTED

kafka.integration.SslTopicMetadataTest > testBasicTopicMetadata PASSED

kafka.integration.SslTopicMetadataTest > testAutoCreateTopicWithInvalidReplication STARTED

kafka.integration.SslTopicMetadataTest > testAutoCreateTopicWithInvalidReplication PASSED

kafka.integration.SslTopicMetadataTest > testAliveBrokersListWithNoTopicsAfterABrokerShutdown
STARTED

kafka.integration.SslTopicMetadataTest > testAliveBrokersListWithNoTopicsAfterABrokerShutdown
PASSED

kafka.integration.SaslSslTopicMetadataTest > testIsrAfterBrokerShutDownAndJoinsBack STARTED

kafka.integration.SaslSslTopicMetadataTest > testIsrAfterBrokerShutDownAndJoinsBack PASSED

kafka.integration.SaslSslTopicMetadataTest > testAutoCreateTopicWithCollision STARTED

kafka.integration.SaslSslTopicMetadataTest > testAutoCreateTopicWithCollision PASSED

kafka.integration.SaslSslTopicMetadataTest > testAliveBrokerListWithNoTopics STARTED

kafka.integration.SaslSslTopicMetadataTest > testAliveBrokerListWithNoTopics PASSED

kafka.integration.SaslSslTopicMetadataTest > testAutoCreateTopic STARTED

kafka.integration.SaslSslTopicMetadataTest > testAutoCreateTopic PASSED

kafka.integration.SaslSslTopicMetadataTest > testGetAllTopicMetadata STARTED

kafka.integration.SaslSslTopicMetadataTest > testGetAllTopicMetadata PASSED

kafka.integration.SaslSslTopicMetadataTest > testAliveBrokersListWithNoTopicsAfterNewBrokerStartup
STARTED

kafka.integration.SaslSslTopicMetadataTest > testAliveBrokersListWithNoTopicsAfterNewBrokerStartup
PASSED

kafka.integration.SaslSslTopicMetadataTest > testBasicTopicMetadata STARTED

kafka.integration.SaslSslTopicMetadataTest > testBasicTopicMetadata PASSED

kafka.integration.SaslSslTopicMetadataTest > testAutoCreateTopicWithInvalidReplication
STARTED

kafka.integration.SaslSslTopicMetadataTest > testAutoCreateTopicWithInvalidReplication
PASSED

kafka.integration.SaslSslTopicMetadataTest > testAliveBrokersListWithNoTopicsAfterABrokerShutdown
STARTED

kafka.integration.SaslSslTopicMetadataTest > testAliveBrokersListWithNoTopicsAfterABrokerShutdown
PASSED

kafka.integration.FetcherTest > testFetcher STARTED

kafka.integration.FetcherTest > testFetcher PASSED

kafka.integration.UncleanLeaderElectionTest > testUncleanLeaderElectionEnabled STARTED

kafka.integration.UncleanLeaderElectionTest > testUncleanLeaderElectionEnabled PASSED

kafka.integration.UncleanLeaderElectionTest > testCleanLeaderElectionDisabledByTopicOverride
STARTED

kafka.integration.UncleanLeaderElectionTest > testCleanLeaderElectionDisabledByTopicOverride
PASSED

kafka.integration.UncleanLeaderElectionTest > testUncleanLeaderElectionDisabled STARTED

kafka.integration.UncleanLeaderElectionTest > testUncleanLeaderElectionDisabled PASSED

kafka.integration.UncleanLeaderElectionTest > testUncleanLeaderElectionInvalidTopicOverride
STARTED

kafka.integration.UncleanLeaderElectionTest > testUncleanLeaderElectionInvalidTopicOverride
PASSED

kafka.integration.UncleanLeaderElectionTest > testUncleanLeaderElectionEnabledByTopicOverride
STARTED

kafka.integration.UncleanLeaderElectionTest > testUncleanLeaderElectionEnabledByTopicOverride
PASSED

kafka.integration.MinIsrConfigTest > testDefaultKafkaConfig STARTED

kafka.integration.MinIsrConfigTest > testDefaultKafkaConfig PASSED

unit.kafka.coordinator.transaction.TransactionCoordinatorIntegrationTest > shouldCommitTransaction
STARTED

unit.kafka.coordinator.transaction.TransactionCoordinatorIntegrationTest > shouldCommitTransaction
PASSED

1342 tests completed, 1 failed, 3 skipped
:kafka-trunk-jdk8:core:test FAILED
:test_core_2_10 FAILED

FAILURE: Build failed with an exception.

* What went wrong:
Execution failed for task ':kafka-trunk-jdk8:core:test'.
> There were failing tests. See the report at: file://<https://builds.apache.org/job/kafka-trunk-jdk8/ws/core/build/reports/tests/test/index.html>

* Try:
Run with --stacktrace option to get the stack trace. Run with --info or --debug option to
get more log output.

BUILD FAILED

Total time: 1 hrs 4 mins 42.285 secs
Build step 'Execute shell' marked build as failure
[FINDBUGS] Collecting findbugs analysis files...
Setting GRADLE_3_4_RC_2_HOME=/home/jenkins/jenkins-slave/tools/hudson.plugins.gradle.GradleInstallation/Gradle_3.4-rc-2
[FINDBUGS] Searching for all files in <https://builds.apache.org/job/kafka-trunk-jdk8/ws/>
that match the pattern **/build/reports/findbugs/*.xml
[FINDBUGS] Parsing 1 file in <https://builds.apache.org/job/kafka-trunk-jdk8/ws/>
[FINDBUGS] Successfully parsed file <https://builds.apache.org/job/kafka-trunk-jdk8/ws/core/build/reports/findbugs/main.xml>
with 0 unique warnings and 0 duplicates.
[FINDBUGS] Computing warning deltas based on reference build #1476
Recording test results
Setting GRADLE_3_4_RC_2_HOME=/home/jenkins/jenkins-slave/tools/hudson.plugins.gradle.GradleInstallation/Gradle_3.4-rc-2
Setting GRADLE_3_4_RC_2_HOME=/home/jenkins/jenkins-slave/tools/hudson.plugins.gradle.GradleInstallation/Gradle_3.4-rc-2
Not sending mail to unregistered user ismael@juma.me.uk
Not sending mail to unregistered user wangguoz@gmail.com
Not sending mail to unregistered user rajinisivaram@googlemail.com

Mime
View raw message