kafka-dev mailing list archives

Site index · List index
Message view « Date » · « Thread »
Top « Date » · « Thread »
From Apache Jenkins Server <jenk...@builds.apache.org>
Subject Build failed in Jenkins: kafka-trunk-jdk8 #1483
Date Thu, 04 May 2017 22:14:36 GMT
See <https://builds.apache.org/job/kafka-trunk-jdk8/1483/display/redirect?page=changes>

Changes:

[wangguoz] KAFKA-5104: DumpLogSegments should not open index files with `rw`

------------------------------------------
[...truncated 1.49 MB...]

kafka.server.epoch.LeaderEpochFileCacheTest > shouldRetainLatestEpochOnClearAllEarliest
PASSED

kafka.server.epoch.LeaderEpochFileCacheTest > shouldPersistEpochsBetweenInstances STARTED

kafka.server.epoch.LeaderEpochFileCacheTest > shouldPersistEpochsBetweenInstances PASSED

kafka.server.epoch.LeaderEpochFileCacheTest > shouldNotClearAnythingIfOffsetToFirstOffset
STARTED

kafka.server.epoch.LeaderEpochFileCacheTest > shouldNotClearAnythingIfOffsetToFirstOffset
PASSED

kafka.server.epoch.LeaderEpochFileCacheTest > shouldNotLetOffsetsGoBackwardsEvenIfEpochsProgress
STARTED

kafka.server.epoch.LeaderEpochFileCacheTest > shouldNotLetOffsetsGoBackwardsEvenIfEpochsProgress
PASSED

kafka.server.epoch.LeaderEpochFileCacheTest > shouldGetFirstOffsetOfSubsequentEpochWhenOffsetRequestedForPreviousEpoch
STARTED

kafka.server.epoch.LeaderEpochFileCacheTest > shouldGetFirstOffsetOfSubsequentEpochWhenOffsetRequestedForPreviousEpoch
PASSED

kafka.server.epoch.LeaderEpochFileCacheTest > shouldUpdateOffsetBetweenEpochBoundariesOnClearEarliest2
STARTED

kafka.server.epoch.LeaderEpochFileCacheTest > shouldUpdateOffsetBetweenEpochBoundariesOnClearEarliest2
PASSED

kafka.server.epoch.LeaderEpochFileCacheTest > shouldClearEarliestOnEmptyCache STARTED

kafka.server.epoch.LeaderEpochFileCacheTest > shouldClearEarliestOnEmptyCache PASSED

kafka.server.epoch.LeaderEpochFileCacheTest > shouldPreserveResetOffsetOnClearEarliestIfOneExists
STARTED

kafka.server.epoch.LeaderEpochFileCacheTest > shouldPreserveResetOffsetOnClearEarliestIfOneExists
PASSED

kafka.server.epoch.LeaderEpochFileCacheTest > shouldUpdateOffsetBetweenEpochBoundariesOnClearEarliest
STARTED

kafka.server.epoch.LeaderEpochFileCacheTest > shouldUpdateOffsetBetweenEpochBoundariesOnClearEarliest
PASSED

kafka.server.epoch.LeaderEpochFileCacheTest > shouldReturnInvalidOffsetIfEpochIsRequestedWhichIsNotCurrentlyTracked
STARTED

kafka.server.epoch.LeaderEpochFileCacheTest > shouldReturnInvalidOffsetIfEpochIsRequestedWhichIsNotCurrentlyTracked
PASSED

kafka.server.epoch.LeaderEpochFileCacheTest > shouldFetchEndOffsetOfEmptyCache STARTED

kafka.server.epoch.LeaderEpochFileCacheTest > shouldFetchEndOffsetOfEmptyCache PASSED

kafka.server.epoch.LeaderEpochFileCacheTest > shouldRetainLatestEpochOnClearAllEarliestAndUpdateItsOffset
STARTED

kafka.server.epoch.LeaderEpochFileCacheTest > shouldRetainLatestEpochOnClearAllEarliestAndUpdateItsOffset
PASSED

kafka.server.epoch.LeaderEpochFileCacheTest > shouldClearAllEntries STARTED

kafka.server.epoch.LeaderEpochFileCacheTest > shouldClearAllEntries PASSED

kafka.server.epoch.LeaderEpochFileCacheTest > shouldClearLatestOnEmptyCache STARTED

kafka.server.epoch.LeaderEpochFileCacheTest > shouldClearLatestOnEmptyCache PASSED

kafka.server.epoch.LeaderEpochFileCacheTest > shouldNotResetEpochHistoryHeadIfUndefinedPassed
STARTED

kafka.server.epoch.LeaderEpochFileCacheTest > shouldNotResetEpochHistoryHeadIfUndefinedPassed
PASSED

kafka.server.ReplicationQuotaManagerTest > shouldThrottleOnlyDefinedReplicas STARTED

kafka.server.ReplicationQuotaManagerTest > shouldThrottleOnlyDefinedReplicas PASSED

kafka.server.ReplicationQuotaManagerTest > shouldSupportWildcardThrottledReplicas STARTED

kafka.server.ReplicationQuotaManagerTest > shouldSupportWildcardThrottledReplicas PASSED

kafka.server.ReplicationQuotaManagerTest > shouldExceedQuotaThenReturnBackBelowBoundAsTimePasses
STARTED

kafka.server.ReplicationQuotaManagerTest > shouldExceedQuotaThenReturnBackBelowBoundAsTimePasses
PASSED

kafka.server.SaslApiVersionsRequestTest > testApiVersionsRequestWithUnsupportedVersion
STARTED

kafka.server.SaslApiVersionsRequestTest > testApiVersionsRequestWithUnsupportedVersion
PASSED

kafka.server.SaslApiVersionsRequestTest > testApiVersionsRequestBeforeSaslHandshakeRequest
STARTED

kafka.server.SaslApiVersionsRequestTest > testApiVersionsRequestBeforeSaslHandshakeRequest
PASSED

kafka.server.SaslApiVersionsRequestTest > testApiVersionsRequestAfterSaslHandshakeRequest
STARTED

kafka.server.SaslApiVersionsRequestTest > testApiVersionsRequestAfterSaslHandshakeRequest
PASSED

kafka.server.ServerMetricsTest > testMetricsConfig STARTED

kafka.server.ServerMetricsTest > testMetricsConfig PASSED

kafka.server.ProduceRequestTest > testSimpleProduceRequest STARTED

kafka.server.ProduceRequestTest > testSimpleProduceRequest PASSED

kafka.server.ProduceRequestTest > testCorruptLz4ProduceRequest STARTED

kafka.server.ProduceRequestTest > testCorruptLz4ProduceRequest PASSED

kafka.server.KafkaMetricReporterClusterIdTest > testClusterIdPresent STARTED

kafka.server.KafkaMetricReporterClusterIdTest > testClusterIdPresent PASSED

kafka.server.ApiVersionsTest > testApiVersions STARTED

kafka.server.ApiVersionsTest > testApiVersions PASSED

kafka.server.DelayedOperationTest > testRequestPurge STARTED

kafka.server.DelayedOperationTest > testRequestPurge PASSED

kafka.server.DelayedOperationTest > testRequestExpiry STARTED

kafka.server.DelayedOperationTest > testRequestExpiry PASSED

kafka.server.DelayedOperationTest > shouldReturnNilOperationsOnCancelForKeyWhenKeyDoesntExist
STARTED

kafka.server.DelayedOperationTest > shouldReturnNilOperationsOnCancelForKeyWhenKeyDoesntExist
PASSED

kafka.server.DelayedOperationTest > shouldCancelForKeyReturningCancelledOperations STARTED

kafka.server.DelayedOperationTest > shouldCancelForKeyReturningCancelledOperations PASSED

kafka.server.DelayedOperationTest > testRequestSatisfaction STARTED

kafka.server.DelayedOperationTest > testRequestSatisfaction PASSED

kafka.server.ControlledShutdownLeaderSelectorTest > testSelectLeader STARTED

kafka.server.ControlledShutdownLeaderSelectorTest > testSelectLeader PASSED

kafka.server.ServerGenerateBrokerIdTest > testGetSequenceIdMethod STARTED

kafka.server.ServerGenerateBrokerIdTest > testGetSequenceIdMethod PASSED

kafka.server.ServerGenerateBrokerIdTest > testBrokerMetadataOnIdCollision STARTED

kafka.server.ServerGenerateBrokerIdTest > testBrokerMetadataOnIdCollision PASSED

kafka.server.ServerGenerateBrokerIdTest > testAutoGenerateBrokerId STARTED

kafka.server.ServerGenerateBrokerIdTest > testAutoGenerateBrokerId PASSED

kafka.server.ServerGenerateBrokerIdTest > testMultipleLogDirsMetaProps STARTED

kafka.server.ServerGenerateBrokerIdTest > testMultipleLogDirsMetaProps PASSED

kafka.server.ServerGenerateBrokerIdTest > testDisableGeneratedBrokerId STARTED

kafka.server.ServerGenerateBrokerIdTest > testDisableGeneratedBrokerId PASSED

kafka.server.ServerGenerateBrokerIdTest > testUserConfigAndGeneratedBrokerId STARTED

kafka.server.ServerGenerateBrokerIdTest > testUserConfigAndGeneratedBrokerId PASSED

kafka.server.ServerGenerateBrokerIdTest > testConsistentBrokerIdFromUserConfigAndMetaProps
STARTED

kafka.server.ServerGenerateBrokerIdTest > testConsistentBrokerIdFromUserConfigAndMetaProps
PASSED

kafka.server.OffsetCommitTest > testUpdateOffsets STARTED

kafka.server.OffsetCommitTest > testUpdateOffsets PASSED

kafka.server.OffsetCommitTest > testLargeMetadataPayload STARTED

kafka.server.OffsetCommitTest > testLargeMetadataPayload PASSED

kafka.server.OffsetCommitTest > testOffsetsDeleteAfterTopicDeletion STARTED

kafka.server.OffsetCommitTest > testOffsetsDeleteAfterTopicDeletion PASSED

kafka.server.OffsetCommitTest > testCommitAndFetchOffsets STARTED

kafka.server.OffsetCommitTest > testCommitAndFetchOffsets PASSED

kafka.server.OffsetCommitTest > testOffsetExpiration STARTED

kafka.server.OffsetCommitTest > testOffsetExpiration PASSED

kafka.server.OffsetCommitTest > testNonExistingTopicOffsetCommit STARTED

kafka.server.OffsetCommitTest > testNonExistingTopicOffsetCommit PASSED

kafka.server.RequestQuotaTest > testUnauthorizedThrottle STARTED

kafka.server.RequestQuotaTest > testUnauthorizedThrottle PASSED

kafka.server.RequestQuotaTest > testUnthrottledClient STARTED

kafka.server.RequestQuotaTest > testUnthrottledClient PASSED

kafka.server.RequestQuotaTest > testExemptRequestTime STARTED

kafka.server.RequestQuotaTest > testExemptRequestTime PASSED

kafka.server.RequestQuotaTest > testResponseThrottleTime STARTED

kafka.server.RequestQuotaTest > testResponseThrottleTime PASSED

kafka.api.KafkaAdminClientIntegrationTest > testGetAllBrokerVersions STARTED

kafka.api.KafkaAdminClientIntegrationTest > testGetAllBrokerVersions PASSED

kafka.api.KafkaAdminClientIntegrationTest > testClose STARTED
ERROR: Could not install GRADLE_3_4_RC_2_HOME
java.lang.NullPointerException

kafka.api.KafkaAdminClientIntegrationTest > testClose PASSED

kafka.api.KafkaAdminClientIntegrationTest > testListNodes STARTED

kafka.api.KafkaAdminClientIntegrationTest > testListNodes PASSED

kafka.api.KafkaAdminClientIntegrationTest > testCreateDeleteTopics STARTED

kafka.api.KafkaAdminClientIntegrationTest > testCreateDeleteTopics PASSED

kafka.api.SaslPlainSslEndToEndAuthorizationTest > testAcls STARTED

kafka.api.SaslPlainSslEndToEndAuthorizationTest > testAcls PASSED

kafka.api.SaslPlainSslEndToEndAuthorizationTest > testTwoConsumersWithDifferentSaslCredentials
STARTED

kafka.api.SaslPlainSslEndToEndAuthorizationTest > testTwoConsumersWithDifferentSaslCredentials
PASSED

kafka.api.SaslPlainSslEndToEndAuthorizationTest > testNoConsumeWithoutDescribeAclViaSubscribe
STARTED
:kafka-trunk-jdk8:core:test FAILED
:test_core_2_11 FAILED

FAILURE: Build failed with an exception.

* What went wrong:
Execution failed for task ':kafka-trunk-jdk8:core:test'.
> Process 'Gradle Test Executor 3' finished with non-zero exit value 137

* Try:
Run with --stacktrace option to get the stack trace. Run with --info or --debug option to
get more log output.

BUILD FAILED

Total time: 1 hrs 32 mins 20.142 secs
Build step 'Execute shell' marked build as failure
[FINDBUGS] Collecting findbugs analysis files...
Setting GRADLE_3_4_RC_2_HOME=/home/jenkins/jenkins-slave/tools/hudson.plugins.gradle.GradleInstallation/Gradle_3.4-rc-2
[FINDBUGS] Searching for all files in <https://builds.apache.org/job/kafka-trunk-jdk8/ws/>
that match the pattern **/build/reports/findbugs/*.xml
[FINDBUGS] Parsing 1 file in <https://builds.apache.org/job/kafka-trunk-jdk8/ws/>
[FINDBUGS] Successfully parsed file <https://builds.apache.org/job/kafka-trunk-jdk8/ws/core/build/reports/findbugs/main.xml>
with 0 unique warnings and 0 duplicates.
[FINDBUGS] Computing warning deltas based on reference build #1476
Recording test results
Setting GRADLE_3_4_RC_2_HOME=/home/jenkins/jenkins-slave/tools/hudson.plugins.gradle.GradleInstallation/Gradle_3.4-rc-2
Setting GRADLE_3_4_RC_2_HOME=/home/jenkins/jenkins-slave/tools/hudson.plugins.gradle.GradleInstallation/Gradle_3.4-rc-2
Not sending mail to unregistered user wangguoz@gmail.com
Not sending mail to unregistered user rajinisivaram@googlemail.com

Mime
View raw message