kafka-dev mailing list archives

Site index · List index
Message view « Date » · « Thread »
Top « Date » · « Thread »
From Apache Jenkins Server <jenk...@builds.apache.org>
Subject Build failed in Jenkins: kafka-trunk-jdk8 #1432
Date Wed, 19 Apr 2017 16:51:55 GMT
See <https://builds.apache.org/job/kafka-trunk-jdk8/1432/display/redirect?page=changes>

Changes:

[ismael] MINOR: Fix some re-raising of exceptions in system tests

------------------------------------------
[...truncated 372.59 KB...]
kafka.admin.AdminRackAwareTest > testAssignmentWith2ReplicasRackAware STARTED

kafka.admin.AdminRackAwareTest > testAssignmentWith2ReplicasRackAware PASSED

kafka.admin.AdminRackAwareTest > testAssignmentWithRackAwareWithUnevenReplicas STARTED

kafka.admin.AdminRackAwareTest > testAssignmentWithRackAwareWithUnevenReplicas PASSED

kafka.admin.AdminRackAwareTest > testSkipBrokerWithReplicaAlreadyAssigned STARTED

kafka.admin.AdminRackAwareTest > testSkipBrokerWithReplicaAlreadyAssigned PASSED

kafka.admin.AdminRackAwareTest > testAssignmentWithRackAware STARTED

kafka.admin.AdminRackAwareTest > testAssignmentWithRackAware PASSED

kafka.admin.AdminRackAwareTest > testRackAwareExpansion STARTED

kafka.admin.AdminRackAwareTest > testRackAwareExpansion PASSED

kafka.admin.AdminRackAwareTest > testAssignmentWith2ReplicasRackAwareWith6Partitions STARTED

kafka.admin.AdminRackAwareTest > testAssignmentWith2ReplicasRackAwareWith6Partitions PASSED

kafka.admin.AdminRackAwareTest > testAssignmentWith2ReplicasRackAwareWith6PartitionsAnd3Brokers
STARTED

kafka.admin.AdminRackAwareTest > testAssignmentWith2ReplicasRackAwareWith6PartitionsAnd3Brokers
PASSED

kafka.admin.AdminRackAwareTest > testGetRackAlternatedBrokerListAndAssignReplicasToBrokers
STARTED

kafka.admin.AdminRackAwareTest > testGetRackAlternatedBrokerListAndAssignReplicasToBrokers
PASSED

kafka.admin.AdminRackAwareTest > testMoreReplicasThanRacks STARTED

kafka.admin.AdminRackAwareTest > testMoreReplicasThanRacks PASSED

kafka.admin.AdminRackAwareTest > testSingleRack STARTED

kafka.admin.AdminRackAwareTest > testSingleRack PASSED

kafka.admin.AdminRackAwareTest > testAssignmentWithRackAwareWithRandomStartIndex STARTED

kafka.admin.AdminRackAwareTest > testAssignmentWithRackAwareWithRandomStartIndex PASSED

kafka.admin.AdminRackAwareTest > testLargeNumberPartitionsAssignment STARTED

kafka.admin.AdminRackAwareTest > testLargeNumberPartitionsAssignment PASSED

kafka.admin.AdminRackAwareTest > testLessReplicasThanRacks STARTED

kafka.admin.AdminRackAwareTest > testLessReplicasThanRacks PASSED

kafka.admin.DeleteConsumerGroupTest > testGroupWideDeleteInZKDoesNothingForActiveConsumerGroup
STARTED

kafka.admin.DeleteConsumerGroupTest > testGroupWideDeleteInZKDoesNothingForActiveConsumerGroup
PASSED

kafka.admin.DeleteConsumerGroupTest > testGroupTopicWideDeleteInZKDoesNothingForActiveGroupConsumingMultipleTopics
STARTED

kafka.admin.DeleteConsumerGroupTest > testGroupTopicWideDeleteInZKDoesNothingForActiveGroupConsumingMultipleTopics
PASSED

kafka.admin.DeleteConsumerGroupTest > testConsumptionOnRecreatedTopicAfterTopicWideDeleteInZK
STARTED

kafka.admin.DeleteConsumerGroupTest > testConsumptionOnRecreatedTopicAfterTopicWideDeleteInZK
PASSED

kafka.admin.DeleteConsumerGroupTest > testTopicWideDeleteInZK STARTED

kafka.admin.DeleteConsumerGroupTest > testTopicWideDeleteInZK PASSED

kafka.admin.DeleteConsumerGroupTest > testGroupTopicWideDeleteInZKForGroupConsumingOneTopic
STARTED

kafka.admin.DeleteConsumerGroupTest > testGroupTopicWideDeleteInZKForGroupConsumingOneTopic
PASSED

kafka.admin.DeleteConsumerGroupTest > testGroupTopicWideDeleteInZKForGroupConsumingMultipleTopics
STARTED

kafka.admin.DeleteConsumerGroupTest > testGroupTopicWideDeleteInZKForGroupConsumingMultipleTopics
PASSED

kafka.admin.DeleteConsumerGroupTest > testGroupWideDeleteInZK STARTED

kafka.admin.DeleteConsumerGroupTest > testGroupWideDeleteInZK PASSED

kafka.admin.AddPartitionsTest > testReplicaPlacementAllServers STARTED

kafka.admin.AddPartitionsTest > testReplicaPlacementAllServers PASSED

kafka.admin.AddPartitionsTest > testWrongReplicaCount STARTED

kafka.admin.AddPartitionsTest > testWrongReplicaCount PASSED

kafka.admin.AddPartitionsTest > testReplicaPlacementPartialServers STARTED

kafka.admin.AddPartitionsTest > testReplicaPlacementPartialServers PASSED

kafka.admin.AddPartitionsTest > testTopicDoesNotExist STARTED

kafka.admin.AddPartitionsTest > testTopicDoesNotExist PASSED

kafka.admin.AddPartitionsTest > testIncrementPartitions STARTED

kafka.admin.AddPartitionsTest > testIncrementPartitions PASSED

kafka.admin.AddPartitionsTest > testManualAssignmentOfReplicas STARTED

kafka.admin.AddPartitionsTest > testManualAssignmentOfReplicas PASSED

kafka.admin.ConfigCommandTest > testScramCredentials STARTED

kafka.admin.ConfigCommandTest > testScramCredentials PASSED

kafka.admin.ConfigCommandTest > shouldParseArgumentsForTopicsEntityType STARTED

kafka.admin.ConfigCommandTest > shouldParseArgumentsForTopicsEntityType PASSED

kafka.admin.ConfigCommandTest > testUserClientQuotaOpts STARTED

kafka.admin.ConfigCommandTest > testUserClientQuotaOpts PASSED

kafka.admin.ConfigCommandTest > shouldAddTopicConfig STARTED

kafka.admin.ConfigCommandTest > shouldAddTopicConfig PASSED

kafka.admin.ConfigCommandTest > shouldAddClientConfig STARTED

kafka.admin.ConfigCommandTest > shouldAddClientConfig PASSED

kafka.admin.ConfigCommandTest > shouldDeleteBrokerConfig STARTED

kafka.admin.ConfigCommandTest > shouldDeleteBrokerConfig PASSED

kafka.admin.ConfigCommandTest > testQuotaConfigEntity STARTED

kafka.admin.ConfigCommandTest > testQuotaConfigEntity PASSED

kafka.admin.ConfigCommandTest > shouldNotUpdateBrokerConfigIfMalformedBracketConfig STARTED

kafka.admin.ConfigCommandTest > shouldNotUpdateBrokerConfigIfMalformedBracketConfig PASSED

kafka.admin.ConfigCommandTest > shouldFailIfUnrecognisedEntityType STARTED

kafka.admin.ConfigCommandTest > shouldFailIfUnrecognisedEntityType PASSED

kafka.admin.ConfigCommandTest > shouldNotUpdateBrokerConfigIfNonExistingConfigIsDeleted
STARTED

kafka.admin.ConfigCommandTest > shouldNotUpdateBrokerConfigIfNonExistingConfigIsDeleted
PASSED

kafka.admin.ConfigCommandTest > shouldNotUpdateBrokerConfigIfMalformedEntityName STARTED

kafka.admin.ConfigCommandTest > shouldNotUpdateBrokerConfigIfMalformedEntityName PASSED

kafka.admin.ConfigCommandTest > shouldSupportCommaSeparatedValues STARTED

kafka.admin.ConfigCommandTest > shouldSupportCommaSeparatedValues PASSED

kafka.admin.ConfigCommandTest > shouldNotUpdateBrokerConfigIfMalformedConfig STARTED

kafka.admin.ConfigCommandTest > shouldNotUpdateBrokerConfigIfMalformedConfig PASSED

kafka.admin.ConfigCommandTest > shouldParseArgumentsForBrokersEntityType STARTED

kafka.admin.ConfigCommandTest > shouldParseArgumentsForBrokersEntityType PASSED

kafka.admin.ConfigCommandTest > shouldAddBrokerConfig STARTED

kafka.admin.ConfigCommandTest > shouldAddBrokerConfig PASSED

kafka.admin.ConfigCommandTest > testQuotaDescribeEntities STARTED

kafka.admin.ConfigCommandTest > testQuotaDescribeEntities PASSED

kafka.admin.ConfigCommandTest > shouldParseArgumentsForClientsEntityType STARTED

kafka.admin.ConfigCommandTest > shouldParseArgumentsForClientsEntityType PASSED

kafka.admin.DescribeConsumerGroupTest > testDescribeConsumersWithNoAssignedPartitionsWithNewConsumer
STARTED

kafka.admin.DescribeConsumerGroupTest > testDescribeConsumersWithNoAssignedPartitionsWithNewConsumer
PASSED

kafka.admin.DescribeConsumerGroupTest > testDescribeWithMultiPartitionTopicAndMultipleConsumersWithNewConsumer
STARTED

kafka.admin.DescribeConsumerGroupTest > testDescribeWithMultiPartitionTopicAndMultipleConsumersWithNewConsumer
PASSED

kafka.admin.DescribeConsumerGroupTest > testDescribeExistingGroup STARTED

kafka.admin.DescribeConsumerGroupTest > testDescribeExistingGroup PASSED

kafka.admin.DescribeConsumerGroupTest > testDescribeConsumersWithNoAssignedPartitions STARTED

kafka.admin.DescribeConsumerGroupTest > testDescribeConsumersWithNoAssignedPartitions PASSED

kafka.admin.DescribeConsumerGroupTest > testDescribeExistingGroupWithNewConsumer STARTED

kafka.admin.DescribeConsumerGroupTest > testDescribeExistingGroupWithNewConsumer PASSED

kafka.admin.DescribeConsumerGroupTest > testDescribeGroupWithNewConsumerWithShortInitializationTimeout
STARTED

kafka.admin.DescribeConsumerGroupTest > testDescribeGroupWithNewConsumerWithShortInitializationTimeout
PASSED

kafka.admin.DescribeConsumerGroupTest > testDescribeNonExistingGroupWithNewConsumer STARTED

kafka.admin.DescribeConsumerGroupTest > testDescribeNonExistingGroupWithNewConsumer PASSED

kafka.admin.DescribeConsumerGroupTest > testDescribeExistingGroupWithNoMembersWithNewConsumer
STARTED

kafka.admin.DescribeConsumerGroupTest > testDescribeExistingGroupWithNoMembersWithNewConsumer
FAILED
    java.lang.AssertionError: Expected no active member in describe group results.
        at kafka.utils.TestUtils$.fail(TestUtils.scala:309)
        at kafka.utils.TestUtils$.waitUntilTrue(TestUtils.scala:805)
        at kafka.admin.DescribeConsumerGroupTest.testDescribeExistingGroupWithNoMembersWithNewConsumer(DescribeConsumerGroupTest.scala:228)

kafka.admin.DescribeConsumerGroupTest > testDescribeNonExistingGroup STARTED

kafka.admin.DescribeConsumerGroupTest > testDescribeNonExistingGroup PASSED

kafka.admin.DescribeConsumerGroupTest > testDescribeExistingGroupWithNoMembers STARTED

kafka.admin.DescribeConsumerGroupTest > testDescribeExistingGroupWithNoMembers PASSED

kafka.admin.AclCommandTest > testInvalidAuthorizerProperty STARTED

kafka.admin.AclCommandTest > testInvalidAuthorizerProperty PASSED

kafka.admin.AclCommandTest > testAclCli STARTED

kafka.admin.AclCommandTest > testAclCli PASSED

kafka.admin.AclCommandTest > testProducerConsumerCli STARTED

kafka.admin.AclCommandTest > testProducerConsumerCli PASSED

1175 tests completed, 1 failed
:kafka-trunk-jdk8:core:test FAILED
:test_core_2_11 FAILED

FAILURE: Build failed with an exception.

* What went wrong:
Execution failed for task ':core:test'.
> There were failing tests. See the report at: file://<https://builds.apache.org/job/kafka-trunk-jdk8/ws/core/build/reports/tests/test/index.html>

* Try:
Run with --stacktrace option to get the stack trace. Run with --info or --debug option to
get more log output.

BUILD FAILED

Total time: 1 hrs 32 mins 12.116 secs
Build step 'Execute shell' marked build as failure
Recording test results
Setting GRADLE_2_4_RC_2_HOME=/home/jenkins/jenkins-slave/tools/hudson.plugins.gradle.GradleInstallation/Gradle_2.4-rc-2
Setting GRADLE_2_4_RC_2_HOME=/home/jenkins/jenkins-slave/tools/hudson.plugins.gradle.GradleInstallation/Gradle_2.4-rc-2
Not sending mail to unregistered user ismael@juma.me.uk

Mime
View raw message