kafka-dev mailing list archives

Site index · List index
Message view « Date » · « Thread »
Top « Date » · « Thread »
From Apache Jenkins Server <jenk...@builds.apache.org>
Subject Build failed in Jenkins: kafka-trunk-jdk7 #1980
Date Thu, 02 Mar 2017 21:14:35 GMT
See <https://builds.apache.org/job/kafka-trunk-jdk7/1980/display/redirect?page=changes>

Changes:

[junrao] KAFKA4811; ReplicaFetchThread may fail to create due to existing metric

------------------------------------------
[...truncated 843.93 KB...]
org.apache.kafka.streams.processor.internals.StateRestorerTest > shouldBeCompletedIfOffsetAndOffsetLimitAreZero
PASSED

org.apache.kafka.streams.processor.internals.InternalTopicConfigTest > shouldHaveCompactionPropSetIfSupplied
STARTED

org.apache.kafka.streams.processor.internals.InternalTopicConfigTest > shouldHaveCompactionPropSetIfSupplied
PASSED

org.apache.kafka.streams.processor.internals.InternalTopicConfigTest > shouldThrowIfNameIsNull
STARTED

org.apache.kafka.streams.processor.internals.InternalTopicConfigTest > shouldThrowIfNameIsNull
PASSED

org.apache.kafka.streams.processor.internals.InternalTopicConfigTest > shouldConfigureRetentionMsWithAdditionalRetentionWhenCompactAndDelete
STARTED

org.apache.kafka.streams.processor.internals.InternalTopicConfigTest > shouldConfigureRetentionMsWithAdditionalRetentionWhenCompactAndDelete
PASSED

org.apache.kafka.streams.processor.internals.InternalTopicConfigTest > shouldBeCompactedIfCleanupPolicyCompactOrCompactAndDelete
STARTED

org.apache.kafka.streams.processor.internals.InternalTopicConfigTest > shouldBeCompactedIfCleanupPolicyCompactOrCompactAndDelete
PASSED

org.apache.kafka.streams.processor.internals.InternalTopicConfigTest > shouldNotBeCompactedWhenCleanupPolicyIsDelete
STARTED

org.apache.kafka.streams.processor.internals.InternalTopicConfigTest > shouldNotBeCompactedWhenCleanupPolicyIsDelete
PASSED

org.apache.kafka.streams.processor.internals.InternalTopicConfigTest > shouldHavePropertiesSuppliedByUser
STARTED

org.apache.kafka.streams.processor.internals.InternalTopicConfigTest > shouldHavePropertiesSuppliedByUser
PASSED

org.apache.kafka.streams.processor.internals.InternalTopicConfigTest > shouldUseCleanupPolicyFromConfigIfSupplied
STARTED

org.apache.kafka.streams.processor.internals.InternalTopicConfigTest > shouldUseCleanupPolicyFromConfigIfSupplied
PASSED

org.apache.kafka.streams.processor.internals.InternalTopicConfigTest > shouldNotConfigureRetentionMsWhenCompact
STARTED

org.apache.kafka.streams.processor.internals.InternalTopicConfigTest > shouldNotConfigureRetentionMsWhenCompact
PASSED

org.apache.kafka.streams.processor.internals.InternalTopicConfigTest > shouldNotConfigureRetentionMsWhenDelete
STARTED

org.apache.kafka.streams.processor.internals.InternalTopicConfigTest > shouldNotConfigureRetentionMsWhenDelete
PASSED

org.apache.kafka.streams.processor.TopologyBuilderTest > shouldNotAllowOffsetResetSourceWithDuplicateSourceName
STARTED

org.apache.kafka.streams.processor.TopologyBuilderTest > shouldNotAllowOffsetResetSourceWithDuplicateSourceName
PASSED

org.apache.kafka.streams.processor.TopologyBuilderTest > shouldNotAllowNullProcessorSupplier
STARTED

org.apache.kafka.streams.processor.TopologyBuilderTest > shouldNotAllowNullProcessorSupplier
PASSED

org.apache.kafka.streams.processor.TopologyBuilderTest > shouldNotSetApplicationIdToNull
STARTED

org.apache.kafka.streams.processor.TopologyBuilderTest > shouldNotSetApplicationIdToNull
PASSED

org.apache.kafka.streams.processor.TopologyBuilderTest > testSourceTopics STARTED

org.apache.kafka.streams.processor.TopologyBuilderTest > testSourceTopics PASSED

org.apache.kafka.streams.processor.TopologyBuilderTest > shouldNotAllowNullNameWhenAddingSink
STARTED

org.apache.kafka.streams.processor.TopologyBuilderTest > shouldNotAllowNullNameWhenAddingSink
PASSED

org.apache.kafka.streams.processor.TopologyBuilderTest > testNamedTopicMatchesAlreadyProvidedPattern
STARTED

org.apache.kafka.streams.processor.TopologyBuilderTest > testNamedTopicMatchesAlreadyProvidedPattern
PASSED

org.apache.kafka.streams.processor.TopologyBuilderTest > shouldAddInternalTopicConfigWithCompactAndDeleteSetForWindowStores
STARTED

org.apache.kafka.streams.processor.TopologyBuilderTest > shouldAddInternalTopicConfigWithCompactAndDeleteSetForWindowStores
PASSED

org.apache.kafka.streams.processor.TopologyBuilderTest > shouldAddInternalTopicConfigWithCompactForNonWindowStores
STARTED

org.apache.kafka.streams.processor.TopologyBuilderTest > shouldAddInternalTopicConfigWithCompactForNonWindowStores
PASSED

org.apache.kafka.streams.processor.TopologyBuilderTest > testAddSinkWithSameName STARTED

org.apache.kafka.streams.processor.TopologyBuilderTest > testAddSinkWithSameName PASSED

org.apache.kafka.streams.processor.TopologyBuilderTest > testAddSinkWithSelfParent STARTED

org.apache.kafka.streams.processor.TopologyBuilderTest > testAddSinkWithSelfParent PASSED

org.apache.kafka.streams.processor.TopologyBuilderTest > testAddProcessorWithSelfParent
STARTED

org.apache.kafka.streams.processor.TopologyBuilderTest > testAddProcessorWithSelfParent
PASSED

org.apache.kafka.streams.processor.TopologyBuilderTest > shouldAssociateStateStoreNameWhenStateStoreSupplierIsInternal
STARTED

org.apache.kafka.streams.processor.TopologyBuilderTest > shouldAssociateStateStoreNameWhenStateStoreSupplierIsInternal
PASSED

org.apache.kafka.streams.processor.TopologyBuilderTest > testAddStateStoreWithSink STARTED

org.apache.kafka.streams.processor.TopologyBuilderTest > testAddStateStoreWithSink PASSED

org.apache.kafka.streams.processor.TopologyBuilderTest > testTopicGroups STARTED

org.apache.kafka.streams.processor.TopologyBuilderTest > testTopicGroups PASSED

org.apache.kafka.streams.processor.TopologyBuilderTest > testBuild STARTED

org.apache.kafka.streams.processor.TopologyBuilderTest > testBuild PASSED

org.apache.kafka.streams.processor.TopologyBuilderTest > shouldNotAllowOffsetResetSourceWithoutTopics
STARTED

org.apache.kafka.streams.processor.TopologyBuilderTest > shouldNotAllowOffsetResetSourceWithoutTopics
PASSED

org.apache.kafka.streams.processor.TopologyBuilderTest > shouldNotAddNullStateStoreSupplier
STARTED

org.apache.kafka.streams.processor.TopologyBuilderTest > shouldNotAddNullStateStoreSupplier
PASSED

org.apache.kafka.streams.processor.TopologyBuilderTest > shouldNotAllowNullNameWhenAddingSource
STARTED

org.apache.kafka.streams.processor.TopologyBuilderTest > shouldNotAllowNullNameWhenAddingSource
PASSED

org.apache.kafka.streams.processor.TopologyBuilderTest > shouldNotAllowNullTopicWhenAddingSink
STARTED

org.apache.kafka.streams.processor.TopologyBuilderTest > shouldNotAllowNullTopicWhenAddingSink
PASSED

org.apache.kafka.streams.processor.TopologyBuilderTest > shouldAddSourceWithOffsetReset
STARTED

org.apache.kafka.streams.processor.TopologyBuilderTest > shouldAddSourceWithOffsetReset
PASSED

org.apache.kafka.streams.processor.TopologyBuilderTest > testAddStateStoreWithSource STARTED

org.apache.kafka.streams.processor.TopologyBuilderTest > testAddStateStoreWithSource PASSED

org.apache.kafka.streams.processor.TopologyBuilderTest > shouldThroughOnUnassignedStateStoreAccess
STARTED

org.apache.kafka.streams.processor.TopologyBuilderTest > shouldThroughOnUnassignedStateStoreAccess
PASSED

org.apache.kafka.streams.processor.TopologyBuilderTest > shouldNotAllowNullProcessorNameWhenConnectingProcessorAndStateStores
STARTED

org.apache.kafka.streams.processor.TopologyBuilderTest > shouldNotAllowNullProcessorNameWhenConnectingProcessorAndStateStores
PASSED

org.apache.kafka.streams.processor.TopologyBuilderTest > testAddSourceWithSameName STARTED

org.apache.kafka.streams.processor.TopologyBuilderTest > testAddSourceWithSameName PASSED

org.apache.kafka.streams.processor.TopologyBuilderTest > testAddMoreThanOnePatternSourceNode
STARTED

org.apache.kafka.streams.processor.TopologyBuilderTest > testAddMoreThanOnePatternSourceNode
PASSED

org.apache.kafka.streams.processor.TopologyBuilderTest > testAddProcessorWithSameName STARTED

org.apache.kafka.streams.processor.TopologyBuilderTest > testAddProcessorWithSameName PASSED

org.apache.kafka.streams.processor.TopologyBuilderTest > shouldSetCorrectSourceNodesWithRegexUpdatedTopics
STARTED

org.apache.kafka.streams.processor.TopologyBuilderTest > shouldSetCorrectSourceNodesWithRegexUpdatedTopics
PASSED

org.apache.kafka.streams.processor.TopologyBuilderTest > testAddSourceWithSameTopic STARTED

org.apache.kafka.streams.processor.TopologyBuilderTest > testAddSourceWithSameTopic PASSED

org.apache.kafka.streams.processor.TopologyBuilderTest > testTopicGroupsByStateStore STARTED

org.apache.kafka.streams.processor.TopologyBuilderTest > testTopicGroupsByStateStore PASSED

org.apache.kafka.streams.processor.TopologyBuilderTest > shouldAddSourceWithoutOffsetReset
STARTED

org.apache.kafka.streams.processor.TopologyBuilderTest > shouldAddSourceWithoutOffsetReset
PASSED

org.apache.kafka.streams.processor.TopologyBuilderTest > testAddStateStoreWithDuplicates
STARTED

org.apache.kafka.streams.processor.TopologyBuilderTest > testAddStateStoreWithDuplicates
PASSED

org.apache.kafka.streams.processor.TopologyBuilderTest > testPatternSourceTopic STARTED

org.apache.kafka.streams.processor.TopologyBuilderTest > testPatternSourceTopic PASSED

org.apache.kafka.streams.processor.TopologyBuilderTest > shouldAssociateStateStoreNameWhenStateStoreSupplierIsExternal
STARTED

org.apache.kafka.streams.processor.TopologyBuilderTest > shouldAssociateStateStoreNameWhenStateStoreSupplierIsExternal
PASSED

org.apache.kafka.streams.processor.TopologyBuilderTest > testAddSinkWithWrongParent STARTED

org.apache.kafka.streams.processor.TopologyBuilderTest > testAddSinkWithWrongParent PASSED

org.apache.kafka.streams.processor.TopologyBuilderTest > testPatternMatchesAlreadyProvidedTopicSource
STARTED

org.apache.kafka.streams.processor.TopologyBuilderTest > testPatternMatchesAlreadyProvidedTopicSource
PASSED

org.apache.kafka.streams.processor.TopologyBuilderTest > testAddSinkConnectedWithMultipleParent
STARTED

org.apache.kafka.streams.processor.TopologyBuilderTest > testAddSinkConnectedWithMultipleParent
PASSED

org.apache.kafka.streams.processor.TopologyBuilderTest > testSubscribeTopicNameAndPattern
STARTED

org.apache.kafka.streams.processor.TopologyBuilderTest > testSubscribeTopicNameAndPattern
PASSED

org.apache.kafka.streams.processor.TopologyBuilderTest > shouldAddPatternSourceWithoutOffsetReset
STARTED

org.apache.kafka.streams.processor.TopologyBuilderTest > shouldAddPatternSourceWithoutOffsetReset
PASSED

org.apache.kafka.streams.processor.TopologyBuilderTest > shouldNotAddNullInternalTopic
STARTED

org.apache.kafka.streams.processor.TopologyBuilderTest > shouldNotAddNullInternalTopic
PASSED

org.apache.kafka.streams.processor.TopologyBuilderTest > testAddProcessorWithWrongParent
STARTED

org.apache.kafka.streams.processor.TopologyBuilderTest > testAddProcessorWithWrongParent
PASSED

org.apache.kafka.streams.processor.TopologyBuilderTest > shouldNotAllowNullNameWhenAddingProcessor
STARTED

org.apache.kafka.streams.processor.TopologyBuilderTest > shouldNotAllowNullNameWhenAddingProcessor
PASSED

org.apache.kafka.streams.processor.TopologyBuilderTest > shouldAddSourcePatternWithOffsetReset
STARTED

org.apache.kafka.streams.processor.TopologyBuilderTest > shouldAddSourcePatternWithOffsetReset
PASSED

org.apache.kafka.streams.processor.TopologyBuilderTest > testAddStateStore STARTED

org.apache.kafka.streams.processor.TopologyBuilderTest > testAddStateStore PASSED

org.apache.kafka.streams.processor.TopologyBuilderTest > testAddSinkConnectedWithParent
STARTED

org.apache.kafka.streams.processor.TopologyBuilderTest > testAddSinkConnectedWithParent
PASSED

org.apache.kafka.streams.processor.TopologyBuilderTest > testAddStateStoreWithNonExistingProcessor
STARTED

org.apache.kafka.streams.processor.TopologyBuilderTest > testAddStateStoreWithNonExistingProcessor
PASSED

org.apache.kafka.streams.processor.TopologyBuilderTest > shouldAddInternalTopicConfigWithCleanupPolicyDeleteForInternalTopics
STARTED

org.apache.kafka.streams.processor.TopologyBuilderTest > shouldAddInternalTopicConfigWithCleanupPolicyDeleteForInternalTopics
PASSED

org.apache.kafka.streams.processor.TopologyBuilderTest > shouldCorrectlyMapStateStoreToInternalTopics
STARTED

org.apache.kafka.streams.processor.TopologyBuilderTest > shouldCorrectlyMapStateStoreToInternalTopics
PASSED

org.apache.kafka.streams.KeyValueTest > shouldHaveSaneEqualsAndHashCode STARTED

org.apache.kafka.streams.KeyValueTest > shouldHaveSaneEqualsAndHashCode PASSED

1008 tests completed, 1 failed
:streams:test FAILED

FAILURE: Build failed with an exception.

* What went wrong:
Execution failed for task ':streams:test'.
> There were failing tests. See the report at: file://<https://builds.apache.org/job/kafka-trunk-jdk7/ws/streams/build/reports/tests/test/index.html>

* Try:
Run with --stacktrace option to get the stack trace. Run with --info or --debug option to
get more log output.

BUILD FAILED

Total time: 2 hrs 35 mins 44.904 secs
Build step 'Execute shell' marked build as failure
Recording test results
Setting GRADLE_2_4_RC_2_HOME=/home/jenkins/jenkins-slave/tools/hudson.plugins.gradle.GradleInstallation/Gradle_2.4-rc-2
Setting GRADLE_2_4_RC_2_HOME=/home/jenkins/jenkins-slave/tools/hudson.plugins.gradle.GradleInstallation/Gradle_2.4-rc-2

Mime
View raw message