kafka-dev mailing list archives

Site index · List index
Message view « Date » · « Thread »
Top « Date » · « Thread »
From Apache Jenkins Server <jenk...@builds.apache.org>
Subject Build failed in Jenkins: kafka-trunk-jdk8 #1289
Date Tue, 21 Feb 2017 14:29:37 GMT
See <https://builds.apache.org/job/kafka-trunk-jdk8/1289/display/redirect?page=changes>

Changes:

[ismael] MINOR: Fix NPE handling unknown APIs in NodeApiVersions.toString

[ismael] MINOR: Add build_eclipse to .gitignore

[ismael] MINOR: Remove unused MessageWriter and CompressionFactory

------------------------------------------
[...truncated 77.74 KB...]
kafka.coordinator.GroupCoordinatorResponseTest > testJoinGroupSessionTimeoutTooLarge STARTED

kafka.coordinator.GroupCoordinatorResponseTest > testJoinGroupSessionTimeoutTooLarge PASSED

kafka.coordinator.GroupCoordinatorResponseTest > testJoinGroupSessionTimeoutTooSmall STARTED

kafka.coordinator.GroupCoordinatorResponseTest > testJoinGroupSessionTimeoutTooSmall PASSED

kafka.coordinator.GroupCoordinatorResponseTest > testSyncGroupEmptyAssignment STARTED

kafka.coordinator.GroupCoordinatorResponseTest > testSyncGroupEmptyAssignment PASSED

kafka.coordinator.GroupCoordinatorResponseTest > testCommitOffsetWithDefaultGeneration
STARTED

kafka.coordinator.GroupCoordinatorResponseTest > testCommitOffsetWithDefaultGeneration
PASSED

kafka.coordinator.GroupCoordinatorResponseTest > testHeartbeatMaintainsSession STARTED

kafka.coordinator.GroupCoordinatorResponseTest > testHeartbeatMaintainsSession PASSED

kafka.coordinator.GroupCoordinatorResponseTest > testFetchAllOffsets STARTED

kafka.coordinator.GroupCoordinatorResponseTest > testFetchAllOffsets PASSED

kafka.coordinator.GroupCoordinatorResponseTest > testJoinGroupFromUnchangedLeaderShouldRebalance
STARTED

kafka.coordinator.GroupCoordinatorResponseTest > testJoinGroupFromUnchangedLeaderShouldRebalance
PASSED

kafka.coordinator.GroupCoordinatorResponseTest > testHeartbeatRebalanceInProgress STARTED

kafka.coordinator.GroupCoordinatorResponseTest > testHeartbeatRebalanceInProgress PASSED

kafka.coordinator.GroupCoordinatorResponseTest > testLeaveGroupUnknownGroup STARTED

kafka.coordinator.GroupCoordinatorResponseTest > testLeaveGroupUnknownGroup PASSED

kafka.coordinator.GroupCoordinatorResponseTest > testListGroupsIncludesRebalancingGroups
STARTED

kafka.coordinator.GroupCoordinatorResponseTest > testListGroupsIncludesRebalancingGroups
PASSED

kafka.coordinator.GroupCoordinatorResponseTest > testSyncGroupFollowerAfterLeader STARTED

kafka.coordinator.GroupCoordinatorResponseTest > testSyncGroupFollowerAfterLeader PASSED

kafka.coordinator.GroupCoordinatorResponseTest > testCommitOffsetInAwaitingSync STARTED

kafka.coordinator.GroupCoordinatorResponseTest > testCommitOffsetInAwaitingSync PASSED

kafka.coordinator.GroupCoordinatorResponseTest > testJoinGroupWrongCoordinator STARTED

kafka.coordinator.GroupCoordinatorResponseTest > testJoinGroupWrongCoordinator PASSED

kafka.coordinator.GroupCoordinatorResponseTest > testFetchOffsetForUnknownPartition STARTED

kafka.coordinator.GroupCoordinatorResponseTest > testFetchOffsetForUnknownPartition PASSED

kafka.coordinator.GroupCoordinatorResponseTest > testJoinGroupUnknownConsumerExistingGroup
STARTED

kafka.coordinator.GroupCoordinatorResponseTest > testJoinGroupUnknownConsumerExistingGroup
PASSED

kafka.coordinator.GroupCoordinatorResponseTest > testSyncGroupFromUnknownGroup STARTED

kafka.coordinator.GroupCoordinatorResponseTest > testSyncGroupFromUnknownGroup PASSED

kafka.coordinator.GroupCoordinatorResponseTest > testJoinGroupInconsistentProtocolType
STARTED

kafka.coordinator.GroupCoordinatorResponseTest > testJoinGroupInconsistentProtocolType
PASSED

kafka.coordinator.GroupCoordinatorResponseTest > testCommitOffsetFromUnknownGroup STARTED

kafka.coordinator.GroupCoordinatorResponseTest > testCommitOffsetFromUnknownGroup PASSED

kafka.coordinator.GroupCoordinatorResponseTest > testLeaveGroupWrongCoordinator STARTED

kafka.coordinator.GroupCoordinatorResponseTest > testLeaveGroupWrongCoordinator PASSED

kafka.coordinator.GroupCoordinatorResponseTest > testCommitMaintainsSession STARTED

kafka.coordinator.GroupCoordinatorResponseTest > testCommitMaintainsSession PASSED

kafka.coordinator.GroupCoordinatorResponseTest > testFetchOffsetNotCoordinatorForGroup
STARTED

kafka.coordinator.GroupCoordinatorResponseTest > testFetchOffsetNotCoordinatorForGroup
PASSED

kafka.coordinator.GroupCoordinatorResponseTest > testLeaveGroupUnknownConsumerExistingGroup
STARTED

kafka.coordinator.GroupCoordinatorResponseTest > testLeaveGroupUnknownConsumerExistingGroup
PASSED

kafka.coordinator.GroupCoordinatorResponseTest > testJoinGroupUnknownConsumerNewGroup STARTED

kafka.coordinator.GroupCoordinatorResponseTest > testJoinGroupUnknownConsumerNewGroup PASSED

kafka.coordinator.GroupCoordinatorResponseTest > testJoinGroupFromUnchangedFollowerDoesNotRebalance
STARTED

kafka.coordinator.GroupCoordinatorResponseTest > testJoinGroupFromUnchangedFollowerDoesNotRebalance
PASSED

kafka.coordinator.GroupCoordinatorResponseTest > testValidJoinGroup STARTED

kafka.coordinator.GroupCoordinatorResponseTest > testValidJoinGroup PASSED

kafka.coordinator.GroupCoordinatorResponseTest > testFetchOffsets STARTED

kafka.coordinator.GroupCoordinatorResponseTest > testFetchOffsets PASSED

kafka.coordinator.GroupCoordinatorResponseTest > testSessionTimeoutDuringRebalance STARTED

kafka.coordinator.GroupCoordinatorResponseTest > testSessionTimeoutDuringRebalance PASSED

kafka.coordinator.GroupCoordinatorResponseTest > testSyncGroupLeaderAfterFollower STARTED

kafka.coordinator.GroupCoordinatorResponseTest > testSyncGroupLeaderAfterFollower PASSED

kafka.coordinator.GroupCoordinatorResponseTest > testSyncGroupFromUnknownMember STARTED

kafka.coordinator.GroupCoordinatorResponseTest > testSyncGroupFromUnknownMember PASSED

kafka.coordinator.GroupCoordinatorResponseTest > testValidLeaveGroup STARTED

kafka.coordinator.GroupCoordinatorResponseTest > testValidLeaveGroup PASSED

kafka.coordinator.GroupCoordinatorResponseTest > testDescribeGroupInactiveGroup STARTED

kafka.coordinator.GroupCoordinatorResponseTest > testDescribeGroupInactiveGroup PASSED

kafka.coordinator.GroupCoordinatorResponseTest > testSyncGroupNotCoordinator STARTED

kafka.coordinator.GroupCoordinatorResponseTest > testSyncGroupNotCoordinator PASSED

kafka.coordinator.GroupCoordinatorResponseTest > testHeartbeatUnknownConsumerExistingGroup
STARTED

kafka.coordinator.GroupCoordinatorResponseTest > testHeartbeatUnknownConsumerExistingGroup
PASSED

kafka.coordinator.GroupCoordinatorResponseTest > testValidHeartbeat STARTED

kafka.coordinator.GroupCoordinatorResponseTest > testValidHeartbeat PASSED

kafka.coordinator.GroupMetadataManagerTest > testStoreNonEmptyGroup STARTED

kafka.coordinator.GroupMetadataManagerTest > testStoreNonEmptyGroup PASSED

kafka.coordinator.GroupMetadataManagerTest > testLoadOffsetsWithTombstones STARTED

kafka.coordinator.GroupMetadataManagerTest > testLoadOffsetsWithTombstones PASSED

kafka.coordinator.GroupMetadataManagerTest > testLoadOffsetsWithoutGroup STARTED

kafka.coordinator.GroupMetadataManagerTest > testLoadOffsetsWithoutGroup PASSED

kafka.coordinator.GroupMetadataManagerTest > testAddGroup STARTED

kafka.coordinator.GroupMetadataManagerTest > testAddGroup PASSED

kafka.coordinator.GroupMetadataManagerTest > testGroupMetadataRemovalWithLogAppendTime
STARTED

kafka.coordinator.GroupMetadataManagerTest > testGroupMetadataRemovalWithLogAppendTime
PASSED

kafka.coordinator.GroupMetadataManagerTest > testOffsetWriteAfterGroupRemoved STARTED

kafka.coordinator.GroupMetadataManagerTest > testOffsetWriteAfterGroupRemoved PASSED

kafka.coordinator.GroupMetadataManagerTest > testCommitOffsetWhenCoordinatorHasMoved STARTED

kafka.coordinator.GroupMetadataManagerTest > testCommitOffsetWhenCoordinatorHasMoved PASSED

kafka.coordinator.GroupMetadataManagerTest > testStoreNonEmptyGroupWhenCoordinatorHasMoved
STARTED

kafka.coordinator.GroupMetadataManagerTest > testStoreNonEmptyGroupWhenCoordinatorHasMoved
PASSED

kafka.coordinator.GroupMetadataManagerTest > testCommitOffset STARTED

kafka.coordinator.GroupMetadataManagerTest > testCommitOffset PASSED

kafka.coordinator.GroupMetadataManagerTest > testGroupMetadataRemoval STARTED

kafka.coordinator.GroupMetadataManagerTest > testGroupMetadataRemoval PASSED

kafka.coordinator.GroupMetadataManagerTest > testLoadGroupWithTombstone STARTED

kafka.coordinator.GroupMetadataManagerTest > testLoadGroupWithTombstone PASSED

kafka.coordinator.GroupMetadataManagerTest > testLoadOffsetsAndGroup STARTED

kafka.coordinator.GroupMetadataManagerTest > testLoadOffsetsAndGroup PASSED

kafka.coordinator.GroupMetadataManagerTest > testStoreGroupErrorMapping STARTED

kafka.coordinator.GroupMetadataManagerTest > testStoreGroupErrorMapping PASSED

kafka.coordinator.GroupMetadataManagerTest > testCommitOffsetFailure STARTED

kafka.coordinator.GroupMetadataManagerTest > testCommitOffsetFailure PASSED

kafka.coordinator.GroupMetadataManagerTest > testExpireOffset STARTED

kafka.coordinator.GroupMetadataManagerTest > testExpireOffset PASSED

kafka.coordinator.GroupMetadataManagerTest > testExpireOffsetsWithActiveGroup STARTED

kafka.coordinator.GroupMetadataManagerTest > testExpireOffsetsWithActiveGroup PASSED

kafka.coordinator.GroupMetadataManagerTest > testExpireGroupWithOffsetsOnly STARTED

kafka.coordinator.GroupMetadataManagerTest > testExpireGroupWithOffsetsOnly PASSED

kafka.coordinator.GroupMetadataManagerTest > testStoreEmptyGroup STARTED

kafka.coordinator.GroupMetadataManagerTest > testStoreEmptyGroup PASSED

kafka.api.SaslScramSslEndToEndAuthorizationTest > testTwoConsumersWithDifferentSaslCredentials
STARTED

kafka.api.SaslScramSslEndToEndAuthorizationTest > testTwoConsumersWithDifferentSaslCredentials
PASSED

kafka.api.SaslScramSslEndToEndAuthorizationTest > testNoConsumeWithoutDescribeAclViaSubscribe
STARTED

kafka.api.SaslScramSslEndToEndAuthorizationTest > testNoConsumeWithoutDescribeAclViaSubscribe
PASSED

kafka.api.SaslScramSslEndToEndAuthorizationTest > testProduceConsumeViaAssign STARTED

kafka.api.SaslScramSslEndToEndAuthorizationTest > testProduceConsumeViaAssign PASSED

kafka.api.SaslScramSslEndToEndAuthorizationTest > testNoConsumeWithDescribeAclViaAssign
STARTED

kafka.api.SaslScramSslEndToEndAuthorizationTest > testNoConsumeWithDescribeAclViaAssign
PASSED

kafka.api.SaslScramSslEndToEndAuthorizationTest > testNoConsumeWithDescribeAclViaSubscribe
STARTED

kafka.api.SaslScramSslEndToEndAuthorizationTest > testNoConsumeWithDescribeAclViaSubscribe
PASSED

kafka.api.SaslScramSslEndToEndAuthorizationTest > testNoConsumeWithoutDescribeAclViaAssign
STARTED
:kafka-trunk-jdk8:core:test FAILED
:test_core_2_10 FAILED

FAILURE: Build failed with an exception.

* What went wrong:
Execution failed for task ':core:test'.
> Process 'Gradle Test Executor 2' finished with non-zero exit value 1

* Try:
Run with --stacktrace option to get the stack trace. Run with --info or --debug option to
get more log output.

BUILD FAILED

Total time: 16 mins 14.799 secs
Build step 'Execute shell' marked build as failure
Recording test results
Setting GRADLE_2_4_RC_2_HOME=/home/jenkins/jenkins-slave/tools/hudson.plugins.gradle.GradleInstallation/Gradle_2.4-rc-2
ERROR: Step ‘Publish JUnit test result report’ failed: No test report files were found.
Configuration error?
Setting GRADLE_2_4_RC_2_HOME=/home/jenkins/jenkins-slave/tools/hudson.plugins.gradle.GradleInstallation/Gradle_2.4-rc-2

Mime
View raw message