kafka-dev mailing list archives

Site index · List index
Message view « Date » · « Thread »
Top « Date » · « Thread »
From Apache Jenkins Server <jenk...@builds.apache.org>
Subject Build failed in Jenkins: kafka-trunk-jdk8 #1288
Date Mon, 20 Feb 2017 07:45:30 GMT
See <https://builds.apache.org/job/kafka-trunk-jdk8/1288/display/redirect?page=changes>

Changes:

[jason] KAFKA-4776; Implement graceful handling for improperly formed compressed

------------------------------------------
[...truncated 615.97 KB...]
org.apache.kafka.common.metrics.MetricsTest > testRemoveInactiveMetrics PASSED

org.apache.kafka.common.metrics.MetricsTest > testMetricName STARTED

org.apache.kafka.common.metrics.MetricsTest > testMetricName PASSED

org.apache.kafka.common.metrics.MetricsTest > testRateWindowing STARTED

org.apache.kafka.common.metrics.MetricsTest > testRateWindowing PASSED

org.apache.kafka.common.metrics.MetricsTest > testTimeWindowing STARTED

org.apache.kafka.common.metrics.MetricsTest > testTimeWindowing PASSED

org.apache.kafka.common.metrics.MetricsTest > testEventWindowing STARTED

org.apache.kafka.common.metrics.MetricsTest > testEventWindowing PASSED

org.apache.kafka.common.metrics.MetricsTest > testRemoveMetric STARTED

org.apache.kafka.common.metrics.MetricsTest > testRemoveMetric PASSED

org.apache.kafka.common.metrics.MetricsTest > testBadSensorHierarchy STARTED

org.apache.kafka.common.metrics.MetricsTest > testBadSensorHierarchy PASSED

org.apache.kafka.common.metrics.MetricsTest > testRemoveSensor STARTED

org.apache.kafka.common.metrics.MetricsTest > testRemoveSensor PASSED

org.apache.kafka.common.metrics.MetricsTest > testPercentiles STARTED

org.apache.kafka.common.metrics.MetricsTest > testPercentiles PASSED

org.apache.kafka.common.metrics.MetricsTest > testSampledStatInitialValue STARTED

org.apache.kafka.common.metrics.MetricsTest > testSampledStatInitialValue PASSED

org.apache.kafka.common.metrics.MetricsTest > testDuplicateMetricName STARTED

org.apache.kafka.common.metrics.MetricsTest > testDuplicateMetricName PASSED

org.apache.kafka.common.metrics.MetricsTest > testQuotas STARTED

org.apache.kafka.common.metrics.MetricsTest > testQuotas PASSED

org.apache.kafka.common.metrics.MetricsTest > testHierarchicalSensors STARTED

org.apache.kafka.common.metrics.MetricsTest > testHierarchicalSensors PASSED

org.apache.kafka.common.utils.CrcTest > testUpdateInt STARTED

org.apache.kafka.common.utils.CrcTest > testUpdateInt PASSED

org.apache.kafka.common.utils.CrcTest > testUpdate STARTED

org.apache.kafka.common.utils.CrcTest > testUpdate PASSED

org.apache.kafka.common.utils.AbstractIteratorTest > testEmptyIterator STARTED

org.apache.kafka.common.utils.AbstractIteratorTest > testEmptyIterator PASSED

org.apache.kafka.common.utils.AbstractIteratorTest > testIterator STARTED

org.apache.kafka.common.utils.AbstractIteratorTest > testIterator PASSED

org.apache.kafka.common.utils.UtilsTest > testAbs STARTED

org.apache.kafka.common.utils.UtilsTest > testAbs PASSED

org.apache.kafka.common.utils.UtilsTest > testMin STARTED

org.apache.kafka.common.utils.UtilsTest > testMin PASSED

org.apache.kafka.common.utils.UtilsTest > testJoin STARTED

org.apache.kafka.common.utils.UtilsTest > testJoin PASSED

org.apache.kafka.common.utils.UtilsTest > testReadFullyOrFailWithPartialFileChannelReads
STARTED

org.apache.kafka.common.utils.UtilsTest > testReadFullyOrFailWithPartialFileChannelReads
PASSED

org.apache.kafka.common.utils.UtilsTest > testReadBytes STARTED

org.apache.kafka.common.utils.UtilsTest > testReadBytes PASSED

org.apache.kafka.common.utils.UtilsTest > testGetHost STARTED

org.apache.kafka.common.utils.UtilsTest > testGetHost PASSED

org.apache.kafka.common.utils.UtilsTest > testGetPort STARTED

org.apache.kafka.common.utils.UtilsTest > testGetPort PASSED

org.apache.kafka.common.utils.UtilsTest > testReadFullyWithPartialFileChannelReads STARTED

org.apache.kafka.common.utils.UtilsTest > testReadFullyWithPartialFileChannelReads PASSED

org.apache.kafka.common.utils.UtilsTest > testReadFullyOrFailWithRealFile STARTED

org.apache.kafka.common.utils.UtilsTest > testReadFullyOrFailWithRealFile PASSED

org.apache.kafka.common.utils.UtilsTest > testReadFullyIfEofIsReached STARTED

org.apache.kafka.common.utils.UtilsTest > testReadFullyIfEofIsReached PASSED

org.apache.kafka.common.utils.UtilsTest > testCloseAll STARTED

org.apache.kafka.common.utils.UtilsTest > testCloseAll PASSED

org.apache.kafka.common.utils.UtilsTest > testFormatAddress STARTED

org.apache.kafka.common.utils.UtilsTest > testFormatAddress PASSED

org.apache.kafka.common.config.ConfigDefTest > testBasicTypes STARTED

org.apache.kafka.common.config.ConfigDefTest > testBasicTypes PASSED

org.apache.kafka.common.config.ConfigDefTest > testNullDefault STARTED

org.apache.kafka.common.config.ConfigDefTest > testNullDefault PASSED

org.apache.kafka.common.config.ConfigDefTest > testParseForValidate STARTED

org.apache.kafka.common.config.ConfigDefTest > testParseForValidate PASSED

org.apache.kafka.common.config.ConfigDefTest > testInvalidDefaultRange STARTED

org.apache.kafka.common.config.ConfigDefTest > testInvalidDefaultRange PASSED

org.apache.kafka.common.config.ConfigDefTest > testGroupInference STARTED

org.apache.kafka.common.config.ConfigDefTest > testGroupInference PASSED

org.apache.kafka.common.config.ConfigDefTest > testValidators STARTED

org.apache.kafka.common.config.ConfigDefTest > testValidators PASSED

org.apache.kafka.common.config.ConfigDefTest > testValidateCannotParse STARTED

org.apache.kafka.common.config.ConfigDefTest > testValidateCannotParse PASSED

org.apache.kafka.common.config.ConfigDefTest > testValidate STARTED

org.apache.kafka.common.config.ConfigDefTest > testValidate PASSED

org.apache.kafka.common.config.ConfigDefTest > testInvalidDefaultString STARTED

org.apache.kafka.common.config.ConfigDefTest > testInvalidDefaultString PASSED

org.apache.kafka.common.config.ConfigDefTest > testSslPasswords STARTED

org.apache.kafka.common.config.ConfigDefTest > testSslPasswords PASSED

org.apache.kafka.common.config.ConfigDefTest > testInvalidDefault STARTED

org.apache.kafka.common.config.ConfigDefTest > testInvalidDefault PASSED

org.apache.kafka.common.config.ConfigDefTest > toRst STARTED

org.apache.kafka.common.config.ConfigDefTest > toRst PASSED

org.apache.kafka.common.config.ConfigDefTest > testMissingRequired STARTED

org.apache.kafka.common.config.ConfigDefTest > testMissingRequired PASSED

org.apache.kafka.common.config.ConfigDefTest > testNullDefaultWithValidator STARTED

org.apache.kafka.common.config.ConfigDefTest > testNullDefaultWithValidator PASSED

org.apache.kafka.common.config.ConfigDefTest > toEnrichedRst STARTED

org.apache.kafka.common.config.ConfigDefTest > toEnrichedRst PASSED

org.apache.kafka.common.config.ConfigDefTest > testDefinedTwice STARTED

org.apache.kafka.common.config.ConfigDefTest > testDefinedTwice PASSED

org.apache.kafka.common.config.ConfigDefTest > testBadInputs STARTED

org.apache.kafka.common.config.ConfigDefTest > testBadInputs PASSED

org.apache.kafka.common.config.ConfigDefTest > testValidateMissingConfigKey STARTED

org.apache.kafka.common.config.ConfigDefTest > testValidateMissingConfigKey PASSED

org.apache.kafka.common.config.AbstractConfigTest > testOriginalsWithPrefix STARTED

org.apache.kafka.common.config.AbstractConfigTest > testOriginalsWithPrefix PASSED

org.apache.kafka.common.config.AbstractConfigTest > testConfiguredInstances STARTED

org.apache.kafka.common.config.AbstractConfigTest > testConfiguredInstances PASSED

org.apache.kafka.common.config.AbstractConfigTest > testValuesWithPrefixOverride STARTED

org.apache.kafka.common.config.AbstractConfigTest > testValuesWithPrefixOverride PASSED

org.apache.kafka.common.config.AbstractConfigTest > testUnused STARTED

org.apache.kafka.common.config.AbstractConfigTest > testUnused PASSED

org.apache.kafka.common.config.AbstractConfigTest > testClassConfigs STARTED

org.apache.kafka.common.config.AbstractConfigTest > testClassConfigs PASSED

org.apache.kafka.common.internals.PartitionStatesTest > testSet STARTED

org.apache.kafka.common.internals.PartitionStatesTest > testSet PASSED

org.apache.kafka.common.internals.PartitionStatesTest > testClear STARTED

org.apache.kafka.common.internals.PartitionStatesTest > testClear PASSED

org.apache.kafka.common.internals.PartitionStatesTest > testRemove STARTED

org.apache.kafka.common.internals.PartitionStatesTest > testRemove PASSED

org.apache.kafka.common.internals.PartitionStatesTest > testMoveToEnd STARTED

org.apache.kafka.common.internals.PartitionStatesTest > testMoveToEnd PASSED

org.apache.kafka.common.internals.PartitionStatesTest > testUpdateAndMoveToEnd STARTED

org.apache.kafka.common.internals.PartitionStatesTest > testUpdateAndMoveToEnd PASSED

org.apache.kafka.common.internals.PartitionStatesTest > testPartitionValues STARTED

org.apache.kafka.common.internals.PartitionStatesTest > testPartitionValues PASSED

1898 tests completed, 1 failed
:clients:test FAILED

FAILURE: Build failed with an exception.

* What went wrong:
Execution failed for task ':clients:test'.
> There were failing tests. See the report at: file://<https://builds.apache.org/job/kafka-trunk-jdk8/ws/clients/build/reports/tests/test/index.html>

* Try:
Run with --stacktrace option to get the stack trace. Run with --info or --debug option to
get more log output.

BUILD FAILED

Total time: 1 hrs 31 mins 43.617 secs
Build step 'Execute shell' marked build as failure
Recording test results
Setting GRADLE_2_4_RC_2_HOME=/home/jenkins/jenkins-slave/tools/hudson.plugins.gradle.GradleInstallation/Gradle_2.4-rc-2
Setting GRADLE_2_4_RC_2_HOME=/home/jenkins/jenkins-slave/tools/hudson.plugins.gradle.GradleInstallation/Gradle_2.4-rc-2

Mime
View raw message