kafka-dev mailing list archives

Site index · List index
Message view « Date » · « Thread »
Top « Date » · « Thread »
From Apache Jenkins Server <jenk...@builds.apache.org>
Subject Build failed in Jenkins: kafka-trunk-jdk7 #1957
Date Wed, 22 Feb 2017 06:55:50 GMT
See <https://builds.apache.org/job/kafka-trunk-jdk7/1957/display/redirect?page=changes>

Changes:

[becket.qin] KAFKA-4757; NetworkClient should log request details at trace level when

------------------------------------------
[...truncated 614.04 KB...]
org.apache.kafka.common.record.MemoryRecordsTest > testFilterToPreservesLogAppendTime[9]
PASSED

org.apache.kafka.common.record.MemoryRecordsTest > testFilterTo[9] STARTED

org.apache.kafka.common.record.MemoryRecordsTest > testFilterTo[9] PASSED

org.apache.kafka.common.record.MemoryRecordsTest > testIterator[9] STARTED

org.apache.kafka.common.record.MemoryRecordsTest > testIterator[9] PASSED

org.apache.kafka.common.record.MemoryRecordsTest > testHasRoomForMethod[10] STARTED

org.apache.kafka.common.record.MemoryRecordsTest > testHasRoomForMethod[10] PASSED

org.apache.kafka.common.record.MemoryRecordsTest > testFilterToPreservesLogAppendTime[10]
STARTED

org.apache.kafka.common.record.MemoryRecordsTest > testFilterToPreservesLogAppendTime[10]
PASSED

org.apache.kafka.common.record.MemoryRecordsTest > testFilterTo[10] STARTED

org.apache.kafka.common.record.MemoryRecordsTest > testFilterTo[10] PASSED

org.apache.kafka.common.record.MemoryRecordsTest > testIterator[10] STARTED

org.apache.kafka.common.record.MemoryRecordsTest > testIterator[10] PASSED

org.apache.kafka.common.record.MemoryRecordsTest > testHasRoomForMethod[11] STARTED

org.apache.kafka.common.record.MemoryRecordsTest > testHasRoomForMethod[11] PASSED

org.apache.kafka.common.record.MemoryRecordsTest > testFilterToPreservesLogAppendTime[11]
STARTED

org.apache.kafka.common.record.MemoryRecordsTest > testFilterToPreservesLogAppendTime[11]
PASSED

org.apache.kafka.common.record.MemoryRecordsTest > testFilterTo[11] STARTED

org.apache.kafka.common.record.MemoryRecordsTest > testFilterTo[11] PASSED

org.apache.kafka.common.record.MemoryRecordsTest > testIterator[11] STARTED

org.apache.kafka.common.record.MemoryRecordsTest > testIterator[11] PASSED

org.apache.kafka.common.record.MemoryRecordsTest > testHasRoomForMethod[12] STARTED

org.apache.kafka.common.record.MemoryRecordsTest > testHasRoomForMethod[12] PASSED

org.apache.kafka.common.record.MemoryRecordsTest > testFilterToPreservesLogAppendTime[12]
STARTED

org.apache.kafka.common.record.MemoryRecordsTest > testFilterToPreservesLogAppendTime[12]
PASSED

org.apache.kafka.common.record.MemoryRecordsTest > testFilterTo[12] STARTED

org.apache.kafka.common.record.MemoryRecordsTest > testFilterTo[12] PASSED

org.apache.kafka.common.record.MemoryRecordsTest > testIterator[12] STARTED

org.apache.kafka.common.record.MemoryRecordsTest > testIterator[12] PASSED

org.apache.kafka.common.record.MemoryRecordsTest > testHasRoomForMethod[13] STARTED

org.apache.kafka.common.record.MemoryRecordsTest > testHasRoomForMethod[13] PASSED

org.apache.kafka.common.record.MemoryRecordsTest > testFilterToPreservesLogAppendTime[13]
STARTED

org.apache.kafka.common.record.MemoryRecordsTest > testFilterToPreservesLogAppendTime[13]
PASSED

org.apache.kafka.common.record.MemoryRecordsTest > testFilterTo[13] STARTED

org.apache.kafka.common.record.MemoryRecordsTest > testFilterTo[13] PASSED

org.apache.kafka.common.record.MemoryRecordsTest > testIterator[13] STARTED

org.apache.kafka.common.record.MemoryRecordsTest > testIterator[13] PASSED

org.apache.kafka.common.record.MemoryRecordsTest > testHasRoomForMethod[14] STARTED

org.apache.kafka.common.record.MemoryRecordsTest > testHasRoomForMethod[14] PASSED

org.apache.kafka.common.record.MemoryRecordsTest > testFilterToPreservesLogAppendTime[14]
STARTED

org.apache.kafka.common.record.MemoryRecordsTest > testFilterToPreservesLogAppendTime[14]
PASSED

org.apache.kafka.common.record.MemoryRecordsTest > testFilterTo[14] STARTED

org.apache.kafka.common.record.MemoryRecordsTest > testFilterTo[14] PASSED

org.apache.kafka.common.record.MemoryRecordsTest > testIterator[14] STARTED

org.apache.kafka.common.record.MemoryRecordsTest > testIterator[14] PASSED

org.apache.kafka.common.record.MemoryRecordsTest > testHasRoomForMethod[15] STARTED

org.apache.kafka.common.record.MemoryRecordsTest > testHasRoomForMethod[15] PASSED

org.apache.kafka.common.record.MemoryRecordsTest > testFilterToPreservesLogAppendTime[15]
STARTED

org.apache.kafka.common.record.MemoryRecordsTest > testFilterToPreservesLogAppendTime[15]
PASSED

org.apache.kafka.common.record.MemoryRecordsTest > testFilterTo[15] STARTED

org.apache.kafka.common.record.MemoryRecordsTest > testFilterTo[15] PASSED

org.apache.kafka.common.record.MemoryRecordsTest > testIterator[15] STARTED

org.apache.kafka.common.record.MemoryRecordsTest > testIterator[15] PASSED

org.apache.kafka.common.serialization.SerializationTest > testSerdeFromUnknown STARTED

org.apache.kafka.common.serialization.SerializationTest > testSerdeFromUnknown PASSED

org.apache.kafka.common.serialization.SerializationTest > testDoubleSerializer STARTED

org.apache.kafka.common.serialization.SerializationTest > testDoubleSerializer PASSED

org.apache.kafka.common.serialization.SerializationTest > testStringSerializer STARTED

org.apache.kafka.common.serialization.SerializationTest > testStringSerializer PASSED

org.apache.kafka.common.serialization.SerializationTest > testIntegerSerializer STARTED

org.apache.kafka.common.serialization.SerializationTest > testIntegerSerializer PASSED

org.apache.kafka.common.serialization.SerializationTest > testLongSerializer STARTED

org.apache.kafka.common.serialization.SerializationTest > testLongSerializer PASSED

org.apache.kafka.common.serialization.SerializationTest > testSerdeFrom STARTED

org.apache.kafka.common.serialization.SerializationTest > testSerdeFrom PASSED

org.apache.kafka.common.serialization.SerializationTest > testSerdeFromNotNull STARTED

org.apache.kafka.common.serialization.SerializationTest > testSerdeFromNotNull PASSED

org.apache.kafka.common.serialization.SerializationTest > testByteBufferSerializer STARTED

org.apache.kafka.common.serialization.SerializationTest > testByteBufferSerializer PASSED

org.apache.kafka.common.config.AbstractConfigTest > testOriginalsWithPrefix STARTED

org.apache.kafka.common.config.AbstractConfigTest > testOriginalsWithPrefix PASSED

org.apache.kafka.common.config.AbstractConfigTest > testConfiguredInstances STARTED

org.apache.kafka.common.config.AbstractConfigTest > testConfiguredInstances PASSED

org.apache.kafka.common.config.AbstractConfigTest > testValuesWithPrefixOverride STARTED

org.apache.kafka.common.config.AbstractConfigTest > testValuesWithPrefixOverride PASSED

org.apache.kafka.common.config.AbstractConfigTest > testUnused STARTED

org.apache.kafka.common.config.AbstractConfigTest > testUnused PASSED

org.apache.kafka.common.config.AbstractConfigTest > testClassConfigs STARTED

org.apache.kafka.common.config.AbstractConfigTest > testClassConfigs PASSED

org.apache.kafka.common.config.ConfigDefTest > testBasicTypes STARTED

org.apache.kafka.common.config.ConfigDefTest > testBasicTypes PASSED

org.apache.kafka.common.config.ConfigDefTest > testNullDefault STARTED

org.apache.kafka.common.config.ConfigDefTest > testNullDefault PASSED

org.apache.kafka.common.config.ConfigDefTest > testParseForValidate STARTED

org.apache.kafka.common.config.ConfigDefTest > testParseForValidate PASSED

org.apache.kafka.common.config.ConfigDefTest > testInvalidDefaultRange STARTED

org.apache.kafka.common.config.ConfigDefTest > testInvalidDefaultRange PASSED

org.apache.kafka.common.config.ConfigDefTest > testGroupInference STARTED

org.apache.kafka.common.config.ConfigDefTest > testGroupInference PASSED

org.apache.kafka.common.config.ConfigDefTest > testValidators STARTED

org.apache.kafka.common.config.ConfigDefTest > testValidators PASSED

org.apache.kafka.common.config.ConfigDefTest > testValidateCannotParse STARTED

org.apache.kafka.common.config.ConfigDefTest > testValidateCannotParse PASSED

org.apache.kafka.common.config.ConfigDefTest > testValidate STARTED

org.apache.kafka.common.config.ConfigDefTest > testValidate PASSED

org.apache.kafka.common.config.ConfigDefTest > testInvalidDefaultString STARTED

org.apache.kafka.common.config.ConfigDefTest > testInvalidDefaultString PASSED

org.apache.kafka.common.config.ConfigDefTest > testSslPasswords STARTED

org.apache.kafka.common.config.ConfigDefTest > testSslPasswords PASSED

org.apache.kafka.common.config.ConfigDefTest > testInvalidDefault STARTED

org.apache.kafka.common.config.ConfigDefTest > testInvalidDefault PASSED

org.apache.kafka.common.config.ConfigDefTest > toRst STARTED

org.apache.kafka.common.config.ConfigDefTest > toRst PASSED

org.apache.kafka.common.config.ConfigDefTest > testMissingRequired STARTED

org.apache.kafka.common.config.ConfigDefTest > testMissingRequired PASSED

org.apache.kafka.common.config.ConfigDefTest > testNullDefaultWithValidator STARTED

org.apache.kafka.common.config.ConfigDefTest > testNullDefaultWithValidator PASSED

org.apache.kafka.common.config.ConfigDefTest > toEnrichedRst STARTED

org.apache.kafka.common.config.ConfigDefTest > toEnrichedRst PASSED

org.apache.kafka.common.config.ConfigDefTest > testDefinedTwice STARTED

org.apache.kafka.common.config.ConfigDefTest > testDefinedTwice PASSED

org.apache.kafka.common.config.ConfigDefTest > testBadInputs STARTED

org.apache.kafka.common.config.ConfigDefTest > testBadInputs PASSED

org.apache.kafka.common.config.ConfigDefTest > testValidateMissingConfigKey STARTED

org.apache.kafka.common.config.ConfigDefTest > testValidateMissingConfigKey PASSED

1901 tests completed, 1 failed
:clients:test FAILED

FAILURE: Build failed with an exception.

* What went wrong:
Execution failed for task ':clients:test'.
> There were failing tests. See the report at: file://<https://builds.apache.org/job/kafka-trunk-jdk7/ws/clients/build/reports/tests/test/index.html>

* Try:
Run with --stacktrace option to get the stack trace. Run with --info or --debug option to
get more log output.

BUILD FAILED

Total time: 1 hrs 17 mins 21.358 secs
Build step 'Execute shell' marked build as failure
Recording test results
Setting GRADLE_2_4_RC_2_HOME=/home/jenkins/jenkins-slave/tools/hudson.plugins.gradle.GradleInstallation/Gradle_2.4-rc-2
Setting GRADLE_2_4_RC_2_HOME=/home/jenkins/jenkins-slave/tools/hudson.plugins.gradle.GradleInstallation/Gradle_2.4-rc-2

Mime
View raw message