kafka-dev mailing list archives

Site index · List index
Message view « Date » · « Thread »
Top « Date » · « Thread »
From Apache Jenkins Server <jenk...@builds.apache.org>
Subject Build failed in Jenkins: kafka-trunk-jdk8 #1207
Date Tue, 24 Jan 2017 13:07:34 GMT
See <https://builds.apache.org/job/kafka-trunk-jdk8/1207/changes>

Changes:

[ismael] KAFKA-4576; Log segments close to max size break on fetch

------------------------------------------
[...truncated 28698 lines...]
org.apache.kafka.common.security.scram.ScramCredentialUtilsTest > generateCredential PASSED

org.apache.kafka.common.security.scram.ScramCredentialUtilsTest > extraneousFields STARTED

org.apache.kafka.common.security.scram.ScramCredentialUtilsTest > extraneousFields PASSED

org.apache.kafka.common.security.scram.ScramCredentialUtilsTest > scramCredentialCache
STARTED

org.apache.kafka.common.security.scram.ScramCredentialUtilsTest > scramCredentialCache
PASSED

org.apache.kafka.common.security.scram.ScramCredentialUtilsTest > invalidCredential STARTED

org.apache.kafka.common.security.scram.ScramCredentialUtilsTest > invalidCredential PASSED

org.apache.kafka.common.security.scram.ScramFormatterTest > rfc7677Example STARTED

org.apache.kafka.common.security.scram.ScramFormatterTest > rfc7677Example PASSED

org.apache.kafka.common.security.scram.ScramFormatterTest > saslName STARTED

org.apache.kafka.common.security.scram.ScramFormatterTest > saslName PASSED

org.apache.kafka.common.security.scram.ScramMessagesTest > validClientFirstMessage STARTED

org.apache.kafka.common.security.scram.ScramMessagesTest > validClientFirstMessage PASSED

org.apache.kafka.common.security.scram.ScramMessagesTest > invalidClientFinalMessage STARTED

org.apache.kafka.common.security.scram.ScramMessagesTest > invalidClientFinalMessage PASSED

org.apache.kafka.common.security.scram.ScramMessagesTest > validServerFirstMessage STARTED

org.apache.kafka.common.security.scram.ScramMessagesTest > validServerFirstMessage PASSED

org.apache.kafka.common.security.scram.ScramMessagesTest > invalidServerFinalMessage STARTED

org.apache.kafka.common.security.scram.ScramMessagesTest > invalidServerFinalMessage PASSED

org.apache.kafka.common.security.scram.ScramMessagesTest > invalidClientFirstMessage STARTED

org.apache.kafka.common.security.scram.ScramMessagesTest > invalidClientFirstMessage PASSED

org.apache.kafka.common.security.scram.ScramMessagesTest > validClientFinalMessage STARTED

org.apache.kafka.common.security.scram.ScramMessagesTest > validClientFinalMessage PASSED

org.apache.kafka.common.security.scram.ScramMessagesTest > invalidServerFirstMessage STARTED

org.apache.kafka.common.security.scram.ScramMessagesTest > invalidServerFirstMessage PASSED

org.apache.kafka.common.security.scram.ScramMessagesTest > validServerFinalMessage STARTED

org.apache.kafka.common.security.scram.ScramMessagesTest > validServerFinalMessage PASSED

org.apache.kafka.common.security.ssl.SslFactoryTest > testClientMode STARTED

org.apache.kafka.common.security.ssl.SslFactoryTest > testClientMode PASSED

org.apache.kafka.common.security.ssl.SslFactoryTest > testSslFactoryConfiguration STARTED

org.apache.kafka.common.security.ssl.SslFactoryTest > testSslFactoryConfiguration PASSED

org.apache.kafka.common.security.kerberos.KerberosNameTest > testParse STARTED

org.apache.kafka.common.security.kerberos.KerberosNameTest > testParse PASSED

org.apache.kafka.common.security.auth.KafkaPrincipalTest > testPrincipalNameCanContainSeparator
STARTED

org.apache.kafka.common.security.auth.KafkaPrincipalTest > testPrincipalNameCanContainSeparator
PASSED

org.apache.kafka.common.security.auth.KafkaPrincipalTest > testEqualsAndHashCode STARTED

org.apache.kafka.common.security.auth.KafkaPrincipalTest > testEqualsAndHashCode PASSED

org.apache.kafka.common.security.JaasUtilsTest > testMissingOptionValue STARTED

org.apache.kafka.common.security.JaasUtilsTest > testMissingOptionValue PASSED

org.apache.kafka.common.security.JaasUtilsTest > testSingleOption STARTED

org.apache.kafka.common.security.JaasUtilsTest > testSingleOption PASSED

org.apache.kafka.common.security.JaasUtilsTest > testNumericOptionWithoutQuotes STARTED

org.apache.kafka.common.security.JaasUtilsTest > testNumericOptionWithoutQuotes PASSED

org.apache.kafka.common.security.JaasUtilsTest > testConfigNoOptions STARTED

org.apache.kafka.common.security.JaasUtilsTest > testConfigNoOptions PASSED

org.apache.kafka.common.security.JaasUtilsTest > testNumericOptionWithQuotes STARTED

org.apache.kafka.common.security.JaasUtilsTest > testNumericOptionWithQuotes PASSED

org.apache.kafka.common.security.JaasUtilsTest > testQuotedOptionValue STARTED

org.apache.kafka.common.security.JaasUtilsTest > testQuotedOptionValue PASSED

org.apache.kafka.common.security.JaasUtilsTest > testMissingLoginModule STARTED

org.apache.kafka.common.security.JaasUtilsTest > testMissingLoginModule PASSED

org.apache.kafka.common.security.JaasUtilsTest > testMissingSemicolon STARTED

org.apache.kafka.common.security.JaasUtilsTest > testMissingSemicolon PASSED

org.apache.kafka.common.security.JaasUtilsTest > testMultipleOptions STARTED

org.apache.kafka.common.security.JaasUtilsTest > testMultipleOptions PASSED

org.apache.kafka.common.security.JaasUtilsTest > testMultipleLoginModules STARTED

org.apache.kafka.common.security.JaasUtilsTest > testMultipleLoginModules PASSED

org.apache.kafka.common.security.JaasUtilsTest > testMissingControlFlag STARTED

org.apache.kafka.common.security.JaasUtilsTest > testMissingControlFlag PASSED

org.apache.kafka.common.security.JaasUtilsTest > testQuotedOptionName STARTED

org.apache.kafka.common.security.JaasUtilsTest > testQuotedOptionName PASSED

org.apache.kafka.common.security.JaasUtilsTest > testControlFlag STARTED

org.apache.kafka.common.security.JaasUtilsTest > testControlFlag PASSED

org.apache.kafka.common.security.authenticator.SaslAuthenticatorTest > testMissingUsernameSaslPlain
STARTED

org.apache.kafka.common.security.authenticator.SaslAuthenticatorTest > testMissingUsernameSaslPlain
PASSED

org.apache.kafka.common.security.authenticator.SaslAuthenticatorTest > testValidSaslScramMechanisms
STARTED

org.apache.kafka.common.security.authenticator.SaslAuthenticatorTest > testValidSaslScramMechanisms
PASSED

org.apache.kafka.common.security.authenticator.SaslAuthenticatorTest > testUnauthenticatedApiVersionsRequestOverPlaintext
STARTED

org.apache.kafka.common.security.authenticator.SaslAuthenticatorTest > testUnauthenticatedApiVersionsRequestOverPlaintext
PASSED

org.apache.kafka.common.security.authenticator.SaslAuthenticatorTest > testMechanismPluggability
STARTED

org.apache.kafka.common.security.authenticator.SaslAuthenticatorTest > testMechanismPluggability
PASSED

org.apache.kafka.common.security.authenticator.SaslAuthenticatorTest > testScramUsernameWithSpecialCharacters
STARTED

org.apache.kafka.common.security.authenticator.SaslAuthenticatorTest > testScramUsernameWithSpecialCharacters
PASSED

org.apache.kafka.common.security.authenticator.SaslAuthenticatorTest > testApiVersionsRequestWithUnsupportedVersion
STARTED

org.apache.kafka.common.security.authenticator.SaslAuthenticatorTest > testApiVersionsRequestWithUnsupportedVersion
PASSED

org.apache.kafka.common.security.authenticator.SaslAuthenticatorTest > testMissingPasswordSaslPlain
STARTED

org.apache.kafka.common.security.authenticator.SaslAuthenticatorTest > testMissingPasswordSaslPlain
PASSED

org.apache.kafka.common.security.authenticator.SaslAuthenticatorTest > testInvalidLoginModule
STARTED

org.apache.kafka.common.security.authenticator.SaslAuthenticatorTest > testInvalidLoginModule
PASSED

org.apache.kafka.common.security.authenticator.SaslAuthenticatorTest > testValidSaslScramSha256
STARTED

org.apache.kafka.common.security.authenticator.SaslAuthenticatorTest > testValidSaslScramSha256
PASSED

org.apache.kafka.common.security.authenticator.SaslAuthenticatorTest > testInvalidMechanism
STARTED

org.apache.kafka.common.security.authenticator.SaslAuthenticatorTest > testInvalidMechanism
PASSED

org.apache.kafka.common.security.authenticator.SaslAuthenticatorTest > testDisabledMechanism
STARTED

org.apache.kafka.common.security.authenticator.SaslAuthenticatorTest > testDisabledMechanism
PASSED

org.apache.kafka.common.security.authenticator.SaslAuthenticatorTest > testDynamicJaasConfiguration
STARTED

org.apache.kafka.common.security.authenticator.SaslAuthenticatorTest > testDynamicJaasConfiguration
PASSED

org.apache.kafka.common.security.authenticator.SaslAuthenticatorTest > testPacketSizeTooBig
STARTED

org.apache.kafka.common.security.authenticator.SaslAuthenticatorTest > testPacketSizeTooBig
PASSED

org.apache.kafka.common.security.authenticator.SaslAuthenticatorTest > testInvalidUsernameSaslPlain
STARTED

org.apache.kafka.common.security.authenticator.SaslAuthenticatorTest > testInvalidUsernameSaslPlain
PASSED

org.apache.kafka.common.security.authenticator.SaslAuthenticatorTest > testUserCredentialsUnavailableForScramMechanism
STARTED

org.apache.kafka.common.security.authenticator.SaslAuthenticatorTest > testUserCredentialsUnavailableForScramMechanism
PASSED

org.apache.kafka.common.security.authenticator.SaslAuthenticatorTest > testMultipleServerMechanisms
STARTED

org.apache.kafka.common.security.authenticator.SaslAuthenticatorTest > testMultipleServerMechanisms
PASSED

org.apache.kafka.common.security.authenticator.SaslAuthenticatorTest > testValidSaslPlainOverPlaintext
STARTED

org.apache.kafka.common.security.authenticator.SaslAuthenticatorTest > testValidSaslPlainOverPlaintext
PASSED

org.apache.kafka.common.security.authenticator.SaslAuthenticatorTest > testValidSaslPlainOverSsl
STARTED

org.apache.kafka.common.security.authenticator.SaslAuthenticatorTest > testValidSaslPlainOverSsl
PASSED

org.apache.kafka.common.security.authenticator.SaslAuthenticatorTest > testInvalidApiVersionsRequestSequence
STARTED

org.apache.kafka.common.security.authenticator.SaslAuthenticatorTest > testInvalidApiVersionsRequestSequence
PASSED

org.apache.kafka.common.security.authenticator.SaslAuthenticatorTest > testDisallowedKafkaRequestsBeforeAuthentication
STARTED

org.apache.kafka.common.security.authenticator.SaslAuthenticatorTest > testDisallowedKafkaRequestsBeforeAuthentication
PASSED

org.apache.kafka.common.security.authenticator.SaslAuthenticatorTest > testUnauthenticatedApiVersionsRequestOverSsl
STARTED

org.apache.kafka.common.security.authenticator.SaslAuthenticatorTest > testUnauthenticatedApiVersionsRequestOverSsl
PASSED

org.apache.kafka.common.security.authenticator.SaslAuthenticatorTest > testInvalidPasswordSaslPlain
STARTED

org.apache.kafka.common.security.authenticator.SaslAuthenticatorTest > testInvalidPasswordSaslPlain
PASSED

org.apache.kafka.common.security.authenticator.SaslAuthenticatorTest > testInvalidPasswordSaslScram
STARTED

org.apache.kafka.common.security.authenticator.SaslAuthenticatorTest > testInvalidPasswordSaslScram
PASSED

org.apache.kafka.common.security.authenticator.SaslAuthenticatorTest > testInvalidSaslPacket
STARTED

org.apache.kafka.common.security.authenticator.SaslAuthenticatorTest > testInvalidSaslPacket
PASSED

org.apache.kafka.common.security.authenticator.SaslAuthenticatorTest > testSaslHandshakeRequestWithUnsupportedVersion
STARTED

org.apache.kafka.common.security.authenticator.SaslAuthenticatorTest > testSaslHandshakeRequestWithUnsupportedVersion
PASSED

org.apache.kafka.common.security.authenticator.SaslAuthenticatorTest > testUnknownUserSaslScram
STARTED

org.apache.kafka.common.security.authenticator.SaslAuthenticatorTest > testUnknownUserSaslScram
PASSED

1859 tests completed, 1 failed
:clients:test FAILED

FAILURE: Build failed with an exception.

* What went wrong:
Execution failed for task ':clients:test'.
> There were failing tests. See the report at: file://<https://builds.apache.org/job/kafka-trunk-jdk8/ws/clients/build/reports/tests/test/index.html>

* Try:
Run with --stacktrace option to get the stack trace. Run with --info or --debug option to
get more log output.

BUILD FAILED

Total time: 1 mins 28.479 secs
Build step 'Execute shell' marked build as failure
Recording test results
Setting GRADLE_2_4_RC_2_HOME=/home/jenkins/jenkins-slave/tools/hudson.plugins.gradle.GradleInstallation/Gradle_2.4-rc-2
Setting GRADLE_2_4_RC_2_HOME=/home/jenkins/jenkins-slave/tools/hudson.plugins.gradle.GradleInstallation/Gradle_2.4-rc-2

Mime
View raw message