kafka-dev mailing list archives

Site index · List index
Message view « Date » · « Thread »
Top « Date » · « Thread »
From Apache Jenkins Server <jenk...@builds.apache.org>
Subject Build failed in Jenkins: kafka-trunk-jdk7 #1882
Date Thu, 26 Jan 2017 19:18:35 GMT
See <https://builds.apache.org/job/kafka-trunk-jdk7/1882/changes>

Changes:

[jason] KAFKA-4699; Invoke producer callbacks before completing the future

------------------------------------------
[...truncated 4064 lines...]

kafka.producer.AsyncProducerTest > testInvalidPartition STARTED

kafka.producer.AsyncProducerTest > testInvalidPartition PASSED

kafka.producer.AsyncProducerTest > testNoBroker STARTED

kafka.producer.AsyncProducerTest > testNoBroker PASSED

kafka.producer.AsyncProducerTest > testProduceAfterClosed STARTED

kafka.producer.AsyncProducerTest > testProduceAfterClosed PASSED

kafka.producer.AsyncProducerTest > testJavaProducer STARTED

kafka.producer.AsyncProducerTest > testJavaProducer PASSED

kafka.producer.AsyncProducerTest > testIncompatibleEncoder STARTED

kafka.producer.AsyncProducerTest > testIncompatibleEncoder PASSED

kafka.metrics.KafkaTimerTest > testKafkaTimer STARTED

kafka.metrics.KafkaTimerTest > testKafkaTimer PASSED

kafka.metrics.MetricsTest > testMetricsReporterAfterDeletingTopic STARTED

kafka.metrics.MetricsTest > testMetricsReporterAfterDeletingTopic PASSED

kafka.metrics.MetricsTest > testBrokerTopicMetricsUnregisteredAfterDeletingTopic STARTED

kafka.metrics.MetricsTest > testBrokerTopicMetricsUnregisteredAfterDeletingTopic PASSED

kafka.metrics.MetricsTest > testClusterIdMetric STARTED

kafka.metrics.MetricsTest > testClusterIdMetric PASSED

kafka.metrics.MetricsTest > testMetricsLeak STARTED

kafka.metrics.MetricsTest > testMetricsLeak PASSED

kafka.zk.ZKPathTest > testCreatePersistentSequentialThrowsException STARTED

kafka.zk.ZKPathTest > testCreatePersistentSequentialThrowsException PASSED

kafka.zk.ZKPathTest > testCreatePersistentSequentialExists STARTED

kafka.zk.ZKPathTest > testCreatePersistentSequentialExists PASSED

kafka.zk.ZKPathTest > testCreateEphemeralPathExists STARTED

kafka.zk.ZKPathTest > testCreateEphemeralPathExists PASSED

kafka.zk.ZKPathTest > testCreatePersistentPath STARTED

kafka.zk.ZKPathTest > testCreatePersistentPath PASSED

kafka.zk.ZKPathTest > testMakeSurePersistsPathExistsThrowsException STARTED

kafka.zk.ZKPathTest > testMakeSurePersistsPathExistsThrowsException PASSED

kafka.zk.ZKPathTest > testCreateEphemeralPathThrowsException STARTED

kafka.zk.ZKPathTest > testCreateEphemeralPathThrowsException PASSED

kafka.zk.ZKPathTest > testCreatePersistentPathThrowsException STARTED

kafka.zk.ZKPathTest > testCreatePersistentPathThrowsException PASSED

kafka.zk.ZKPathTest > testMakeSurePersistsPathExists STARTED

kafka.zk.ZKPathTest > testMakeSurePersistsPathExists PASSED

kafka.zk.ZKEphemeralTest > testOverlappingSessions[0] STARTED

kafka.zk.ZKEphemeralTest > testOverlappingSessions[0] PASSED

kafka.zk.ZKEphemeralTest > testEphemeralNodeCleanup[0] STARTED

kafka.zk.ZKEphemeralTest > testEphemeralNodeCleanup[0] PASSED

kafka.zk.ZKEphemeralTest > testZkWatchedEphemeral[0] STARTED

kafka.zk.ZKEphemeralTest > testZkWatchedEphemeral[0] PASSED

kafka.zk.ZKEphemeralTest > testSameSession[0] STARTED

kafka.zk.ZKEphemeralTest > testSameSession[0] PASSED

kafka.zk.ZKEphemeralTest > testOverlappingSessions[1] STARTED

kafka.zk.ZKEphemeralTest > testOverlappingSessions[1] PASSED

kafka.zk.ZKEphemeralTest > testEphemeralNodeCleanup[1] STARTED

kafka.zk.ZKEphemeralTest > testEphemeralNodeCleanup[1] PASSED

kafka.zk.ZKEphemeralTest > testZkWatchedEphemeral[1] STARTED

kafka.zk.ZKEphemeralTest > testZkWatchedEphemeral[1] PASSED

kafka.zk.ZKEphemeralTest > testSameSession[1] STARTED

kafka.zk.ZKEphemeralTest > testSameSession[1] PASSED

kafka.security.auth.AclTest > testAclJsonConversion STARTED

kafka.security.auth.AclTest > testAclJsonConversion PASSED

kafka.security.auth.ResourceTypeTest > testFromString STARTED

kafka.security.auth.ResourceTypeTest > testFromString PASSED

kafka.security.auth.ZkAuthorizationTest > testIsZkSecurityEnabled STARTED

kafka.security.auth.ZkAuthorizationTest > testIsZkSecurityEnabled PASSED

kafka.security.auth.ZkAuthorizationTest > testZkUtils STARTED

kafka.security.auth.ZkAuthorizationTest > testZkUtils PASSED

kafka.security.auth.ZkAuthorizationTest > testZkAntiMigration STARTED

kafka.security.auth.ZkAuthorizationTest > testZkAntiMigration PASSED

kafka.security.auth.ZkAuthorizationTest > testZkMigration STARTED

kafka.security.auth.ZkAuthorizationTest > testZkMigration PASSED

kafka.security.auth.ZkAuthorizationTest > testChroot STARTED

kafka.security.auth.ZkAuthorizationTest > testChroot PASSED

kafka.security.auth.ZkAuthorizationTest > testDelete STARTED

kafka.security.auth.ZkAuthorizationTest > testDelete PASSED

kafka.security.auth.ZkAuthorizationTest > testDeleteRecursive STARTED

kafka.security.auth.ZkAuthorizationTest > testDeleteRecursive PASSED

kafka.security.auth.SimpleAclAuthorizerTest > testAllowAllAccess STARTED

kafka.security.auth.SimpleAclAuthorizerTest > testAllowAllAccess PASSED

kafka.security.auth.SimpleAclAuthorizerTest > testLocalConcurrentModificationOfResourceAcls
STARTED

kafka.security.auth.SimpleAclAuthorizerTest > testLocalConcurrentModificationOfResourceAcls
PASSED

kafka.security.auth.SimpleAclAuthorizerTest > testHighConcurrencyDeletionOfResourceAcls
STARTED

kafka.security.auth.SimpleAclAuthorizerTest > testHighConcurrencyDeletionOfResourceAcls
PASSED

kafka.security.auth.SimpleAclAuthorizerTest > testNoAclFound STARTED

kafka.security.auth.SimpleAclAuthorizerTest > testNoAclFound PASSED

kafka.security.auth.SimpleAclAuthorizerTest > testDistributedConcurrentModificationOfResourceAcls
STARTED

kafka.security.auth.SimpleAclAuthorizerTest > testDistributedConcurrentModificationOfResourceAcls
PASSED

kafka.security.auth.SimpleAclAuthorizerTest > testAclManagementAPIs STARTED

kafka.security.auth.SimpleAclAuthorizerTest > testAclManagementAPIs PASSED

kafka.security.auth.SimpleAclAuthorizerTest > testWildCardAcls STARTED

kafka.security.auth.SimpleAclAuthorizerTest > testWildCardAcls PASSED

kafka.security.auth.SimpleAclAuthorizerTest > testTopicAcl STARTED

kafka.security.auth.SimpleAclAuthorizerTest > testTopicAcl PASSED

kafka.security.auth.SimpleAclAuthorizerTest > testSuperUserHasAccess STARTED

kafka.security.auth.SimpleAclAuthorizerTest > testSuperUserHasAccess PASSED

kafka.security.auth.SimpleAclAuthorizerTest > testDenyTakesPrecedence STARTED

kafka.security.auth.SimpleAclAuthorizerTest > testDenyTakesPrecedence PASSED

kafka.security.auth.SimpleAclAuthorizerTest > testNoAclFoundOverride STARTED

kafka.security.auth.SimpleAclAuthorizerTest > testNoAclFoundOverride PASSED

kafka.security.auth.SimpleAclAuthorizerTest > testHighConcurrencyModificationOfResourceAcls
STARTED

kafka.security.auth.SimpleAclAuthorizerTest > testHighConcurrencyModificationOfResourceAcls
PASSED

kafka.security.auth.SimpleAclAuthorizerTest > testLoadCache STARTED

kafka.security.auth.SimpleAclAuthorizerTest > testLoadCache PASSED

kafka.security.auth.OperationTest > testFromString STARTED

kafka.security.auth.OperationTest > testFromString PASSED

kafka.security.auth.PermissionTypeTest > testFromString STARTED

kafka.security.auth.PermissionTypeTest > testFromString PASSED

kafka.controller.ControllerFailoverTest > testMetadataUpdate STARTED

kafka.controller.ControllerFailoverTest > testMetadataUpdate PASSED

kafka.cluster.BrokerEndPointTest > testEndpointFromUri STARTED

kafka.cluster.BrokerEndPointTest > testEndpointFromUri PASSED

kafka.cluster.BrokerEndPointTest > testHashAndEquals STARTED

kafka.cluster.BrokerEndPointTest > testHashAndEquals PASSED

kafka.cluster.BrokerEndPointTest > testFromJsonFutureVersion STARTED

kafka.cluster.BrokerEndPointTest > testFromJsonFutureVersion PASSED

kafka.cluster.BrokerEndPointTest > testBrokerEndpointFromUri STARTED

kafka.cluster.BrokerEndPointTest > testBrokerEndpointFromUri PASSED

kafka.cluster.BrokerEndPointTest > testFromJsonV1 STARTED

kafka.cluster.BrokerEndPointTest > testFromJsonV1 PASSED

kafka.cluster.BrokerEndPointTest > testFromJsonV2 STARTED

kafka.cluster.BrokerEndPointTest > testFromJsonV2 PASSED

1036 tests completed, 1 failed
:kafka-trunk-jdk7:core:test FAILED
:test_core_2_10 FAILED

FAILURE: Build failed with an exception.

* What went wrong:
Execution failed for task ':core:test'.
> There were failing tests. See the report at: file://<https://builds.apache.org/job/kafka-trunk-jdk7/ws/core/build/reports/tests/test/index.html>

* Try:
Run with --stacktrace option to get the stack trace. Run with --info or --debug option to
get more log output.

BUILD FAILED

Total time: 39 mins 42.133 secs
Build step 'Execute shell' marked build as failure
Recording test results
Setting GRADLE_2_4_RC_2_HOME=/home/jenkins/jenkins-slave/tools/hudson.plugins.gradle.GradleInstallation/Gradle_2.4-rc-2
Setting GRADLE_2_4_RC_2_HOME=/home/jenkins/jenkins-slave/tools/hudson.plugins.gradle.GradleInstallation/Gradle_2.4-rc-2

Mime
View raw message