kafka-dev mailing list archives

Site index · List index
Message view « Date » · « Thread »
Top « Date » · « Thread »
From Apache Jenkins Server <jenk...@builds.apache.org>
Subject Build failed in Jenkins: kafka-trunk-jdk7 #1865
Date Mon, 23 Jan 2017 19:59:54 GMT
See <https://builds.apache.org/job/kafka-trunk-jdk7/1865/changes>

Changes:

[wangguoz] HOTFIX: KAFKA-4060 and KAFKA-4476 follow up

[wangguoz] KAFKA-4060 Follow-up: update docs accordingly

------------------------------------------
[...truncated 8392 lines...]

kafka.log.LogTest > testReadWithTooSmallMaxLength STARTED

kafka.log.LogTest > testReadWithTooSmallMaxLength PASSED

kafka.log.LogTest > testOverCompactedLogRecovery STARTED

kafka.log.LogTest > testOverCompactedLogRecovery PASSED

kafka.log.LogTest > testBogusIndexSegmentsAreRemoved STARTED

kafka.log.LogTest > testBogusIndexSegmentsAreRemoved PASSED

kafka.log.LogTest > testCompressedMessages STARTED

kafka.log.LogTest > testCompressedMessages PASSED

kafka.log.LogTest > testAppendMessageWithNullPayload STARTED

kafka.log.LogTest > testAppendMessageWithNullPayload PASSED

kafka.log.LogTest > testCorruptLog STARTED

kafka.log.LogTest > testCorruptLog PASSED

kafka.log.LogTest > testLogRecoversToCorrectOffset STARTED

kafka.log.LogTest > testLogRecoversToCorrectOffset PASSED

kafka.log.LogTest > testReopenThenTruncate STARTED

kafka.log.LogTest > testReopenThenTruncate PASSED

kafka.log.LogTest > testParseTopicPartitionNameForMissingPartition STARTED

kafka.log.LogTest > testParseTopicPartitionNameForMissingPartition PASSED

kafka.log.LogTest > testParseTopicPartitionNameForEmptyName STARTED

kafka.log.LogTest > testParseTopicPartitionNameForEmptyName PASSED

kafka.log.LogTest > testOpenDeletesObsoleteFiles STARTED

kafka.log.LogTest > testOpenDeletesObsoleteFiles PASSED

kafka.log.LogTest > testRebuildTimeIndexForOldMessages STARTED

kafka.log.LogTest > testRebuildTimeIndexForOldMessages PASSED

kafka.log.LogTest > testSizeBasedLogRoll STARTED

kafka.log.LogTest > testSizeBasedLogRoll PASSED

kafka.log.LogTest > shouldNotDeleteSizeBasedSegmentsWhenUnderRetentionSize STARTED

kafka.log.LogTest > shouldNotDeleteSizeBasedSegmentsWhenUnderRetentionSize PASSED

kafka.log.LogTest > testTimeBasedLogRollJitter STARTED

kafka.log.LogTest > testTimeBasedLogRollJitter PASSED

kafka.log.LogTest > testParseTopicPartitionName STARTED

kafka.log.LogTest > testParseTopicPartitionName PASSED

kafka.log.LogTest > testTruncateTo STARTED

kafka.log.LogTest > testTruncateTo PASSED

kafka.log.LogTest > testCleanShutdownFile STARTED

kafka.log.LogTest > testCleanShutdownFile PASSED

kafka.log.LogTest > testBuildTimeIndexWhenNotAssigningOffsets STARTED

kafka.log.LogTest > testBuildTimeIndexWhenNotAssigningOffsets PASSED

kafka.log.BrokerCompressionTest > testBrokerSideCompression[0] STARTED

kafka.log.BrokerCompressionTest > testBrokerSideCompression[0] PASSED

kafka.log.BrokerCompressionTest > testBrokerSideCompression[1] STARTED

kafka.log.BrokerCompressionTest > testBrokerSideCompression[1] PASSED

kafka.log.BrokerCompressionTest > testBrokerSideCompression[2] STARTED

kafka.log.BrokerCompressionTest > testBrokerSideCompression[2] PASSED

kafka.log.BrokerCompressionTest > testBrokerSideCompression[3] STARTED

kafka.log.BrokerCompressionTest > testBrokerSideCompression[3] PASSED

kafka.log.BrokerCompressionTest > testBrokerSideCompression[4] STARTED

kafka.log.BrokerCompressionTest > testBrokerSideCompression[4] PASSED

kafka.log.BrokerCompressionTest > testBrokerSideCompression[5] STARTED

kafka.log.BrokerCompressionTest > testBrokerSideCompression[5] PASSED

kafka.log.BrokerCompressionTest > testBrokerSideCompression[6] STARTED

kafka.log.BrokerCompressionTest > testBrokerSideCompression[6] PASSED

kafka.log.BrokerCompressionTest > testBrokerSideCompression[7] STARTED

kafka.log.BrokerCompressionTest > testBrokerSideCompression[7] PASSED

kafka.log.BrokerCompressionTest > testBrokerSideCompression[8] STARTED

kafka.log.BrokerCompressionTest > testBrokerSideCompression[8] PASSED

kafka.log.BrokerCompressionTest > testBrokerSideCompression[9] STARTED

kafka.log.BrokerCompressionTest > testBrokerSideCompression[9] PASSED

kafka.log.BrokerCompressionTest > testBrokerSideCompression[10] STARTED

kafka.log.BrokerCompressionTest > testBrokerSideCompression[10] PASSED

kafka.log.BrokerCompressionTest > testBrokerSideCompression[11] STARTED

kafka.log.BrokerCompressionTest > testBrokerSideCompression[11] PASSED

kafka.log.BrokerCompressionTest > testBrokerSideCompression[12] STARTED

kafka.log.BrokerCompressionTest > testBrokerSideCompression[12] PASSED

kafka.log.BrokerCompressionTest > testBrokerSideCompression[13] STARTED

kafka.log.BrokerCompressionTest > testBrokerSideCompression[13] PASSED

kafka.log.BrokerCompressionTest > testBrokerSideCompression[14] STARTED

kafka.log.BrokerCompressionTest > testBrokerSideCompression[14] PASSED

kafka.log.BrokerCompressionTest > testBrokerSideCompression[15] STARTED

kafka.log.BrokerCompressionTest > testBrokerSideCompression[15] PASSED

kafka.log.BrokerCompressionTest > testBrokerSideCompression[16] STARTED

kafka.log.BrokerCompressionTest > testBrokerSideCompression[16] PASSED

kafka.log.BrokerCompressionTest > testBrokerSideCompression[17] STARTED

kafka.log.BrokerCompressionTest > testBrokerSideCompression[17] PASSED

kafka.log.BrokerCompressionTest > testBrokerSideCompression[18] STARTED

kafka.log.BrokerCompressionTest > testBrokerSideCompression[18] PASSED

kafka.log.BrokerCompressionTest > testBrokerSideCompression[19] STARTED

kafka.log.BrokerCompressionTest > testBrokerSideCompression[19] PASSED

kafka.log.LogCleanerIntegrationTest > testCleansCombinedCompactAndDeleteTopic[0] STARTED

kafka.log.LogCleanerIntegrationTest > testCleansCombinedCompactAndDeleteTopic[0] PASSED

kafka.log.LogCleanerIntegrationTest > testCleaningNestedMessagesWithMultipleVersions[0]
STARTED

kafka.log.LogCleanerIntegrationTest > testCleaningNestedMessagesWithMultipleVersions[0]
PASSED

kafka.log.LogCleanerIntegrationTest > cleanerTest[0] STARTED

kafka.log.LogCleanerIntegrationTest > cleanerTest[0] PASSED

kafka.log.LogCleanerIntegrationTest > testCleanerWithMessageFormatV0[0] STARTED

kafka.log.LogCleanerIntegrationTest > testCleanerWithMessageFormatV0[0] PASSED

kafka.log.LogCleanerIntegrationTest > testCleansCombinedCompactAndDeleteTopic[1] STARTED

kafka.log.LogCleanerIntegrationTest > testCleansCombinedCompactAndDeleteTopic[1] PASSED

kafka.log.LogCleanerIntegrationTest > testCleaningNestedMessagesWithMultipleVersions[1]
STARTED

kafka.log.LogCleanerIntegrationTest > testCleaningNestedMessagesWithMultipleVersions[1]
PASSED

kafka.log.LogCleanerIntegrationTest > cleanerTest[1] STARTED

kafka.log.LogCleanerIntegrationTest > cleanerTest[1] PASSED

kafka.log.LogCleanerIntegrationTest > testCleanerWithMessageFormatV0[1] STARTED

kafka.log.LogCleanerIntegrationTest > testCleanerWithMessageFormatV0[1] PASSED

kafka.log.LogCleanerIntegrationTest > testCleansCombinedCompactAndDeleteTopic[2] STARTED

kafka.log.LogCleanerIntegrationTest > testCleansCombinedCompactAndDeleteTopic[2] PASSED

kafka.log.LogCleanerIntegrationTest > testCleaningNestedMessagesWithMultipleVersions[2]
STARTED

kafka.log.LogCleanerIntegrationTest > testCleaningNestedMessagesWithMultipleVersions[2]
PASSED

kafka.log.LogCleanerIntegrationTest > cleanerTest[2] STARTED

kafka.log.LogCleanerIntegrationTest > cleanerTest[2] PASSED

kafka.log.LogCleanerIntegrationTest > testCleanerWithMessageFormatV0[2] STARTED

kafka.log.LogCleanerIntegrationTest > testCleanerWithMessageFormatV0[2] PASSED

kafka.log.LogCleanerIntegrationTest > testCleansCombinedCompactAndDeleteTopic[3] STARTED

kafka.log.LogCleanerIntegrationTest > testCleansCombinedCompactAndDeleteTopic[3] PASSED

kafka.log.LogCleanerIntegrationTest > testCleaningNestedMessagesWithMultipleVersions[3]
STARTED

kafka.log.LogCleanerIntegrationTest > testCleaningNestedMessagesWithMultipleVersions[3]
PASSED

kafka.log.LogCleanerIntegrationTest > cleanerTest[3] STARTED

kafka.log.LogCleanerIntegrationTest > cleanerTest[3] PASSED

kafka.log.LogCleanerIntegrationTest > testCleanerWithMessageFormatV0[3] STARTED

kafka.log.LogCleanerIntegrationTest > testCleanerWithMessageFormatV0[3] PASSED

unit.kafka.server.ApiVersionsTest > testApiVersions STARTED

unit.kafka.server.ApiVersionsTest > testApiVersions PASSED

integration.kafka.api.GroupCoordinatorIntegrationTest > testGroupCoordinatorPropagatesOfffsetsTopicCompressionCodec
STARTED

integration.kafka.api.GroupCoordinatorIntegrationTest > testGroupCoordinatorPropagatesOfffsetsTopicCompressionCodec
PASSED

1047 tests completed, 1 failed
:kafka-trunk-jdk7:core:test FAILED
:test_core_2_11 FAILED

FAILURE: Build failed with an exception.

* What went wrong:
Execution failed for task ':core:test'.
> There were failing tests. See the report at: file://<https://builds.apache.org/job/kafka-trunk-jdk7/ws/core/build/reports/tests/test/index.html>

* Try:
Run with --stacktrace option to get the stack trace. Run with --info or --debug option to
get more log output.

BUILD FAILED

Total time: 1 hrs 18 mins 23.595 secs
Build step 'Execute shell' marked build as failure
Recording test results
Setting GRADLE_2_4_RC_2_HOME=/home/jenkins/jenkins-slave/tools/hudson.plugins.gradle.GradleInstallation/Gradle_2.4-rc-2
Setting GRADLE_2_4_RC_2_HOME=/home/jenkins/jenkins-slave/tools/hudson.plugins.gradle.GradleInstallation/Gradle_2.4-rc-2

Mime
View raw message