kafka-dev mailing list archives

Site index · List index
Message view « Date » · « Thread »
Top « Date » · « Thread »
From Apache Jenkins Server <jenk...@builds.apache.org>
Subject Build failed in Jenkins: kafka-0.10.1-jdk7 #113
Date Wed, 25 Jan 2017 00:38:39 GMT
See <https://builds.apache.org/job/kafka-0.10.1-jdk7/113/changes>

Changes:

[jason] KAFKA-4547; Avoid unnecessary offset commit that could lead to an

------------------------------------------
[...truncated 4338 lines...]

kafka.integration.SaslPlaintextTopicMetadataTest > testGetAllTopicMetadata STARTED

kafka.integration.SaslPlaintextTopicMetadataTest > testGetAllTopicMetadata PASSED

kafka.integration.SaslPlaintextTopicMetadataTest > testAliveBrokersListWithNoTopicsAfterNewBrokerStartup
STARTED

kafka.integration.SaslPlaintextTopicMetadataTest > testAliveBrokersListWithNoTopicsAfterNewBrokerStartup
PASSED

kafka.integration.SaslPlaintextTopicMetadataTest > testBasicTopicMetadata STARTED

kafka.integration.SaslPlaintextTopicMetadataTest > testBasicTopicMetadata PASSED

kafka.integration.SaslPlaintextTopicMetadataTest > testAutoCreateTopicWithInvalidReplication
STARTED

kafka.integration.SaslPlaintextTopicMetadataTest > testAutoCreateTopicWithInvalidReplication
PASSED

kafka.integration.SaslPlaintextTopicMetadataTest > testAliveBrokersListWithNoTopicsAfterABrokerShutdown
STARTED

kafka.integration.SaslPlaintextTopicMetadataTest > testAliveBrokersListWithNoTopicsAfterABrokerShutdown
PASSED

kafka.integration.UncleanLeaderElectionTest > testUncleanLeaderElectionEnabled STARTED

kafka.integration.UncleanLeaderElectionTest > testUncleanLeaderElectionEnabled PASSED

kafka.integration.UncleanLeaderElectionTest > testCleanLeaderElectionDisabledByTopicOverride
STARTED

kafka.integration.UncleanLeaderElectionTest > testCleanLeaderElectionDisabledByTopicOverride
PASSED

kafka.integration.UncleanLeaderElectionTest > testUncleanLeaderElectionDisabled STARTED

kafka.integration.UncleanLeaderElectionTest > testUncleanLeaderElectionDisabled PASSED

kafka.integration.UncleanLeaderElectionTest > testUncleanLeaderElectionInvalidTopicOverride
STARTED

kafka.integration.UncleanLeaderElectionTest > testUncleanLeaderElectionInvalidTopicOverride
PASSED

kafka.integration.UncleanLeaderElectionTest > testUncleanLeaderElectionEnabledByTopicOverride
STARTED

kafka.integration.UncleanLeaderElectionTest > testUncleanLeaderElectionEnabledByTopicOverride
PASSED

kafka.integration.FetcherTest > testFetcher STARTED

kafka.integration.FetcherTest > testFetcher PASSED

kafka.integration.AutoOffsetResetTest > testResetToLatestWhenOffsetTooLow STARTED

kafka.integration.AutoOffsetResetTest > testResetToLatestWhenOffsetTooLow PASSED

kafka.integration.AutoOffsetResetTest > testResetToEarliestWhenOffsetTooLow STARTED

kafka.integration.AutoOffsetResetTest > testResetToEarliestWhenOffsetTooLow PASSED

kafka.integration.AutoOffsetResetTest > testResetToEarliestWhenOffsetTooHigh STARTED

kafka.integration.AutoOffsetResetTest > testResetToEarliestWhenOffsetTooHigh PASSED

kafka.integration.AutoOffsetResetTest > testResetToLatestWhenOffsetTooHigh STARTED

kafka.integration.AutoOffsetResetTest > testResetToLatestWhenOffsetTooHigh PASSED

kafka.integration.MinIsrConfigTest > testDefaultKafkaConfig STARTED

kafka.integration.MinIsrConfigTest > testDefaultKafkaConfig PASSED

kafka.integration.PlaintextTopicMetadataTest > testIsrAfterBrokerShutDownAndJoinsBack STARTED

kafka.integration.PlaintextTopicMetadataTest > testIsrAfterBrokerShutDownAndJoinsBack PASSED

kafka.integration.PlaintextTopicMetadataTest > testAutoCreateTopicWithCollision STARTED

kafka.integration.PlaintextTopicMetadataTest > testAutoCreateTopicWithCollision PASSED

kafka.integration.PlaintextTopicMetadataTest > testAliveBrokerListWithNoTopics STARTED

kafka.integration.PlaintextTopicMetadataTest > testAliveBrokerListWithNoTopics PASSED

kafka.integration.PlaintextTopicMetadataTest > testAutoCreateTopic STARTED

kafka.integration.PlaintextTopicMetadataTest > testAutoCreateTopic PASSED

kafka.integration.PlaintextTopicMetadataTest > testGetAllTopicMetadata STARTED

kafka.integration.PlaintextTopicMetadataTest > testGetAllTopicMetadata PASSED

kafka.integration.PlaintextTopicMetadataTest > testAliveBrokersListWithNoTopicsAfterNewBrokerStartup
STARTED

kafka.integration.PlaintextTopicMetadataTest > testAliveBrokersListWithNoTopicsAfterNewBrokerStartup
PASSED

kafka.integration.PlaintextTopicMetadataTest > testBasicTopicMetadata STARTED

kafka.integration.PlaintextTopicMetadataTest > testBasicTopicMetadata PASSED

kafka.integration.PlaintextTopicMetadataTest > testAutoCreateTopicWithInvalidReplication
STARTED

kafka.integration.PlaintextTopicMetadataTest > testAutoCreateTopicWithInvalidReplication
PASSED

kafka.integration.PlaintextTopicMetadataTest > testAliveBrokersListWithNoTopicsAfterABrokerShutdown
STARTED

kafka.integration.PlaintextTopicMetadataTest > testAliveBrokersListWithNoTopicsAfterABrokerShutdown
PASSED

kafka.network.SocketServerTest > testClientDisconnectionUpdatesRequestMetrics STARTED

kafka.network.SocketServerTest > testClientDisconnectionUpdatesRequestMetrics PASSED

kafka.network.SocketServerTest > testMaxConnectionsPerIp STARTED

kafka.network.SocketServerTest > testMaxConnectionsPerIp PASSED

kafka.network.SocketServerTest > testBrokerSendAfterChannelClosedUpdatesRequestMetrics
STARTED

kafka.network.SocketServerTest > testBrokerSendAfterChannelClosedUpdatesRequestMetrics
PASSED

kafka.network.SocketServerTest > simpleRequest STARTED

kafka.network.SocketServerTest > simpleRequest PASSED

kafka.network.SocketServerTest > testSessionPrincipal STARTED

kafka.network.SocketServerTest > testSessionPrincipal PASSED

kafka.network.SocketServerTest > testMaxConnectionsPerIpOverrides STARTED

kafka.network.SocketServerTest > testMaxConnectionsPerIpOverrides PASSED

kafka.network.SocketServerTest > testSocketsCloseOnShutdown STARTED

kafka.network.SocketServerTest > testSocketsCloseOnShutdown PASSED

kafka.network.SocketServerTest > testSslSocketServer STARTED

kafka.network.SocketServerTest > testSslSocketServer PASSED

kafka.network.SocketServerTest > tooBigRequestIsRejected STARTED

kafka.network.SocketServerTest > tooBigRequestIsRejected PASSED

kafka.metrics.MetricsTest > testMetricsReporterAfterDeletingTopic STARTED

kafka.metrics.MetricsTest > testMetricsReporterAfterDeletingTopic PASSED

kafka.metrics.MetricsTest > testBrokerTopicMetricsUnregisteredAfterDeletingTopic STARTED

kafka.metrics.MetricsTest > testBrokerTopicMetricsUnregisteredAfterDeletingTopic PASSED

kafka.metrics.MetricsTest > testClusterIdMetric STARTED

kafka.metrics.MetricsTest > testClusterIdMetric PASSED

kafka.metrics.MetricsTest > testMetricsLeak STARTED

kafka.metrics.MetricsTest > testMetricsLeak PASSED

kafka.metrics.KafkaTimerTest > testKafkaTimer STARTED

kafka.metrics.KafkaTimerTest > testKafkaTimer PASSED

kafka.api.SaslMultiMechanismConsumerTest > testMultipleBrokerMechanisms STARTED

kafka.api.SaslMultiMechanismConsumerTest > testMultipleBrokerMechanisms PASSED

kafka.api.SaslMultiMechanismConsumerTest > testCoordinatorFailover STARTED

kafka.api.SaslMultiMechanismConsumerTest > testCoordinatorFailover PASSED

kafka.api.SaslMultiMechanismConsumerTest > testSimpleConsumption STARTED

kafka.api.SaslMultiMechanismConsumerTest > testSimpleConsumption PASSED

kafka.api.SaslSslConsumerTest > testCoordinatorFailover STARTED

kafka.api.SaslSslConsumerTest > testCoordinatorFailover PASSED

kafka.api.SaslSslConsumerTest > testSimpleConsumption STARTED

kafka.api.SaslSslConsumerTest > testSimpleConsumption PASSED

kafka.api.UserQuotaTest > testProducerConsumerOverrideUnthrottled STARTED

kafka.api.UserQuotaTest > testProducerConsumerOverrideUnthrottled PASSED

kafka.api.UserQuotaTest > testThrottledProducerConsumer STARTED

kafka.api.UserQuotaTest > testThrottledProducerConsumer PASSED

kafka.api.UserQuotaTest > testQuotaOverrideDelete STARTED

kafka.api.UserQuotaTest > testQuotaOverrideDelete PASSED

kafka.api.SaslPlainSslEndToEndAuthorizationTest > testNoConsumeWithoutDescribeAclViaSubscribe
STARTED

kafka.api.SaslPlainSslEndToEndAuthorizationTest > testNoConsumeWithoutDescribeAclViaSubscribe
PASSED

kafka.api.SaslPlainSslEndToEndAuthorizationTest > testProduceConsumeViaAssign STARTED

kafka.api.SaslPlainSslEndToEndAuthorizationTest > testProduceConsumeViaAssign PASSED

kafka.api.SaslPlainSslEndToEndAuthorizationTest > testNoConsumeWithDescribeAclViaAssign
STARTED

kafka.api.SaslPlainSslEndToEndAuthorizationTest > testNoConsumeWithDescribeAclViaAssign
PASSED

kafka.api.SaslPlainSslEndToEndAuthorizationTest > testNoConsumeWithDescribeAclViaSubscribe
STARTED

kafka.api.SaslPlainSslEndToEndAuthorizationTest > testNoConsumeWithDescribeAclViaSubscribe
PASSED

kafka.api.SaslPlainSslEndToEndAuthorizationTest > testNoConsumeWithoutDescribeAclViaAssign
STARTED

kafka.api.SaslPlainSslEndToEndAuthorizationTest > testNoConsumeWithoutDescribeAclViaAssign
PASSED

kafka.api.SaslPlainSslEndToEndAuthorizationTest > testNoGroupAcl STARTED

kafka.api.SaslPlainSslEndToEndAuthorizationTest > testNoGroupAcl PASSED

kafka.api.SaslPlainSslEndToEndAuthorizationTest > testNoProduceWithDescribeAcl STARTED

kafka.api.SaslPlainSslEndToEndAuthorizationTest > testNoProduceWithDescribeAcl PASSED

kafka.api.SaslPlainSslEndToEndAuthorizationTest > testProduceConsumeViaSubscribe STARTED

kafka.api.SaslPlainSslEndToEndAuthorizationTest > testProduceConsumeViaSubscribe PASSED

kafka.api.SaslPlainSslEndToEndAuthorizationTest > testNoProduceWithoutDescribeAcl STARTED

kafka.api.SaslPlainSslEndToEndAuthorizationTest > testNoProduceWithoutDescribeAcl PASSED

kafka.api.UserClientIdQuotaTest > testProducerConsumerOverrideUnthrottled STARTED

kafka.api.UserClientIdQuotaTest > testProducerConsumerOverrideUnthrottled PASSED

kafka.api.UserClientIdQuotaTest > testThrottledProducerConsumer STARTED
:kafka-0.10.1-jdk7:core:test FAILED
:test_core_2_11 FAILED

FAILURE: Build failed with an exception.

* What went wrong:
Execution failed for task ':core:test'.
> Process 'Gradle Test Executor 2' finished with non-zero exit value 1

* Try:
Run with --stacktrace option to get the stack trace. Run with --info or --debug option to
get more log output.

BUILD FAILED

Total time: 46 mins 59.456 secs
Build step 'Execute shell' marked build as failure
Recording test results
Setting GRADLE_2_4_RC_2_HOME=/home/jenkins/jenkins-slave/tools/hudson.plugins.gradle.GradleInstallation/Gradle_2.4-rc-2
Setting GRADLE_2_4_RC_2_HOME=/home/jenkins/jenkins-slave/tools/hudson.plugins.gradle.GradleInstallation/Gradle_2.4-rc-2

Mime
View raw message