kafka-dev mailing list archives

Site index · List index
Message view « Date » · « Thread »
Top « Date » · « Thread »
From Apache Jenkins Server <jenk...@builds.apache.org>
Subject Build failed in Jenkins: kafka-trunk-jdk8 #1043
Date Wed, 16 Nov 2016 19:22:01 GMT
See <https://builds.apache.org/job/kafka-trunk-jdk8/1043/changes>

Changes:

[jason] MINOR: Remove unused `ByteBoundedBlockingQueue` class and

------------------------------------------
[...truncated 6405 lines...]

kafka.api.AdminClientTest > testDescribeConsumerGroup STARTED

kafka.api.AdminClientTest > testDescribeConsumerGroup PASSED

kafka.api.AdminClientTest > testListGroups STARTED

kafka.api.AdminClientTest > testListGroups PASSED

kafka.api.AdminClientTest > testDescribeConsumerGroupForNonExistentGroup STARTED

kafka.api.AdminClientTest > testDescribeConsumerGroupForNonExistentGroup PASSED

kafka.api.AdminClientTest > testGetConsumerGroupSummary STARTED

kafka.api.AdminClientTest > testGetConsumerGroupSummary PASSED

kafka.api.SslEndToEndAuthorizationTest > testNoConsumeWithoutDescribeAclViaSubscribe STARTED

kafka.api.SslEndToEndAuthorizationTest > testNoConsumeWithoutDescribeAclViaSubscribe PASSED

kafka.api.SslEndToEndAuthorizationTest > testProduceConsumeViaAssign STARTED

kafka.api.SslEndToEndAuthorizationTest > testProduceConsumeViaAssign PASSED

kafka.api.SslEndToEndAuthorizationTest > testNoConsumeWithDescribeAclViaAssign STARTED

kafka.api.SslEndToEndAuthorizationTest > testNoConsumeWithDescribeAclViaAssign PASSED

kafka.api.SslEndToEndAuthorizationTest > testNoConsumeWithDescribeAclViaSubscribe STARTED

kafka.api.SslEndToEndAuthorizationTest > testNoConsumeWithDescribeAclViaSubscribe PASSED

kafka.api.SslEndToEndAuthorizationTest > testNoConsumeWithoutDescribeAclViaAssign STARTED

kafka.api.SslEndToEndAuthorizationTest > testNoConsumeWithoutDescribeAclViaAssign PASSED

kafka.api.SslEndToEndAuthorizationTest > testNoGroupAcl STARTED

kafka.api.SslEndToEndAuthorizationTest > testNoGroupAcl PASSED

kafka.api.SslEndToEndAuthorizationTest > testNoProduceWithDescribeAcl STARTED

kafka.api.SslEndToEndAuthorizationTest > testNoProduceWithDescribeAcl PASSED

kafka.api.SslEndToEndAuthorizationTest > testProduceConsumeViaSubscribe STARTED

kafka.api.SslEndToEndAuthorizationTest > testProduceConsumeViaSubscribe PASSED

kafka.api.SslEndToEndAuthorizationTest > testNoProduceWithoutDescribeAcl STARTED

kafka.api.SslEndToEndAuthorizationTest > testNoProduceWithoutDescribeAcl PASSED

kafka.api.RackAwareAutoTopicCreationTest > testAutoCreateTopic STARTED

kafka.api.RackAwareAutoTopicCreationTest > testAutoCreateTopic PASSED

kafka.api.PlaintextConsumerTest > testEarliestOrLatestOffsets STARTED

kafka.api.PlaintextConsumerTest > testEarliestOrLatestOffsets PASSED

kafka.api.PlaintextConsumerTest > testPartitionsForAutoCreate STARTED

kafka.api.PlaintextConsumerTest > testPartitionsForAutoCreate PASSED

kafka.api.PlaintextConsumerTest > testShrinkingTopicSubscriptions STARTED

kafka.api.PlaintextConsumerTest > testShrinkingTopicSubscriptions PASSED

kafka.api.PlaintextConsumerTest > testMaxPollIntervalMs STARTED

kafka.api.PlaintextConsumerTest > testMaxPollIntervalMs PASSED

kafka.api.PlaintextConsumerTest > testOffsetsForTimes STARTED

kafka.api.PlaintextConsumerTest > testOffsetsForTimes PASSED

kafka.api.PlaintextConsumerTest > testSubsequentPatternSubscription STARTED

kafka.api.PlaintextConsumerTest > testSubsequentPatternSubscription PASSED

kafka.api.PlaintextConsumerTest > testAsyncCommit STARTED

kafka.api.PlaintextConsumerTest > testAsyncCommit PASSED

kafka.api.PlaintextConsumerTest > testLowMaxFetchSizeForRequestAndPartition STARTED

kafka.api.PlaintextConsumerTest > testLowMaxFetchSizeForRequestAndPartition PASSED

kafka.api.PlaintextConsumerTest > testMultiConsumerSessionTimeoutOnStopPolling STARTED

kafka.api.PlaintextConsumerTest > testMultiConsumerSessionTimeoutOnStopPolling PASSED

kafka.api.PlaintextConsumerTest > testMaxPollIntervalMsDelayInRevocation STARTED

kafka.api.PlaintextConsumerTest > testMaxPollIntervalMsDelayInRevocation PASSED

kafka.api.PlaintextConsumerTest > testPartitionsForInvalidTopic STARTED

kafka.api.PlaintextConsumerTest > testPartitionsForInvalidTopic PASSED

kafka.api.PlaintextConsumerTest > testPauseStateNotPreservedByRebalance STARTED

kafka.api.PlaintextConsumerTest > testPauseStateNotPreservedByRebalance PASSED

kafka.api.PlaintextConsumerTest > testFetchHonoursFetchSizeIfLargeRecordNotFirst STARTED

kafka.api.PlaintextConsumerTest > testFetchHonoursFetchSizeIfLargeRecordNotFirst PASSED

kafka.api.PlaintextConsumerTest > testSeek STARTED

kafka.api.PlaintextConsumerTest > testSeek PASSED

kafka.api.PlaintextConsumerTest > testPositionAndCommit STARTED

kafka.api.PlaintextConsumerTest > testPositionAndCommit PASSED

kafka.api.PlaintextConsumerTest > testFetchRecordLargerThanMaxPartitionFetchBytes STARTED

kafka.api.PlaintextConsumerTest > testFetchRecordLargerThanMaxPartitionFetchBytes PASSED

kafka.api.PlaintextConsumerTest > testUnsubscribeTopic STARTED

kafka.api.PlaintextConsumerTest > testUnsubscribeTopic PASSED

kafka.api.PlaintextConsumerTest > testMultiConsumerSessionTimeoutOnClose STARTED

kafka.api.PlaintextConsumerTest > testMultiConsumerSessionTimeoutOnClose PASSED

kafka.api.PlaintextConsumerTest > testFetchRecordLargerThanFetchMaxBytes STARTED

kafka.api.PlaintextConsumerTest > testFetchRecordLargerThanFetchMaxBytes PASSED

kafka.api.PlaintextConsumerTest > testMultiConsumerDefaultAssignment STARTED

kafka.api.PlaintextConsumerTest > testMultiConsumerDefaultAssignment PASSED

kafka.api.PlaintextConsumerTest > testAutoCommitOnClose STARTED

kafka.api.PlaintextConsumerTest > testAutoCommitOnClose PASSED

kafka.api.PlaintextConsumerTest > testListTopics STARTED

kafka.api.PlaintextConsumerTest > testListTopics PASSED

kafka.api.PlaintextConsumerTest > testExpandingTopicSubscriptions STARTED

kafka.api.PlaintextConsumerTest > testExpandingTopicSubscriptions PASSED

kafka.api.PlaintextConsumerTest > testInterceptors STARTED

kafka.api.PlaintextConsumerTest > testInterceptors PASSED

kafka.api.PlaintextConsumerTest > testPatternUnsubscription STARTED

kafka.api.PlaintextConsumerTest > testPatternUnsubscription PASSED

kafka.api.PlaintextConsumerTest > testGroupConsumption STARTED

kafka.api.PlaintextConsumerTest > testGroupConsumption PASSED

kafka.api.PlaintextConsumerTest > testPartitionsFor STARTED

kafka.api.PlaintextConsumerTest > testPartitionsFor PASSED

kafka.api.PlaintextConsumerTest > testAutoCommitOnRebalance STARTED

kafka.api.PlaintextConsumerTest > testAutoCommitOnRebalance PASSED

kafka.api.PlaintextConsumerTest > testInterceptorsWithWrongKeyValue STARTED

kafka.api.PlaintextConsumerTest > testInterceptorsWithWrongKeyValue PASSED

kafka.api.PlaintextConsumerTest > testMaxPollIntervalMsDelayInAssignment STARTED

kafka.api.PlaintextConsumerTest > testMaxPollIntervalMsDelayInAssignment PASSED

kafka.api.PlaintextConsumerTest > testMultiConsumerRoundRobinAssignment STARTED

kafka.api.PlaintextConsumerTest > testMultiConsumerRoundRobinAssignment PASSED

kafka.api.PlaintextConsumerTest > testPartitionPauseAndResume STARTED

kafka.api.PlaintextConsumerTest > testPartitionPauseAndResume PASSED

kafka.api.PlaintextConsumerTest > testConsumeMessagesWithLogAppendTime STARTED

kafka.api.PlaintextConsumerTest > testConsumeMessagesWithLogAppendTime PASSED

kafka.api.PlaintextConsumerTest > testAutoCommitOnCloseAfterWakeup STARTED

kafka.api.PlaintextConsumerTest > testAutoCommitOnCloseAfterWakeup PASSED

kafka.api.PlaintextConsumerTest > testMaxPollRecords STARTED

kafka.api.PlaintextConsumerTest > testMaxPollRecords PASSED

kafka.api.PlaintextConsumerTest > testAutoOffsetReset STARTED

kafka.api.PlaintextConsumerTest > testAutoOffsetReset PASSED

kafka.api.PlaintextConsumerTest > testFetchInvalidOffset STARTED

kafka.api.PlaintextConsumerTest > testFetchInvalidOffset PASSED

kafka.api.PlaintextConsumerTest > testAutoCommitIntercept STARTED

kafka.api.PlaintextConsumerTest > testAutoCommitIntercept PASSED

kafka.api.PlaintextConsumerTest > testFetchHonoursMaxPartitionFetchBytesIfLargeRecordNotFirst
STARTED

kafka.api.PlaintextConsumerTest > testFetchHonoursMaxPartitionFetchBytesIfLargeRecordNotFirst
PASSED

kafka.api.PlaintextConsumerTest > testCommitSpecifiedOffsets STARTED

kafka.api.PlaintextConsumerTest > testCommitSpecifiedOffsets PASSED

kafka.api.PlaintextConsumerTest > testCommitMetadata STARTED

kafka.api.PlaintextConsumerTest > testCommitMetadata PASSED

kafka.api.PlaintextConsumerTest > testRoundRobinAssignment STARTED

kafka.api.PlaintextConsumerTest > testRoundRobinAssignment PASSED

kafka.api.PlaintextConsumerTest > testPatternSubscription STARTED

kafka.api.PlaintextConsumerTest > testPatternSubscription PASSED

kafka.api.PlaintextConsumerTest > testCoordinatorFailover STARTED
:kafka-trunk-jdk8:core:test FAILED
:test_core_2_11 FAILED

FAILURE: Build failed with an exception.

* What went wrong:
Execution failed for task ':core:test'.
> Process 'Gradle Test Executor 2' finished with non-zero exit value 1

* Try:
Run with --stacktrace option to get the stack trace. Run with --info or --debug option to
get more log output.

BUILD FAILED

Total time: 1 hrs 6 mins 54.27 secs
Build step 'Execute shell' marked build as failure
Recording test results
Setting GRADLE_2_4_RC_2_HOME=/home/jenkins/jenkins-slave/tools/hudson.plugins.gradle.GradleInstallation/Gradle_2.4-rc-2
Setting GRADLE_2_4_RC_2_HOME=/home/jenkins/jenkins-slave/tools/hudson.plugins.gradle.GradleInstallation/Gradle_2.4-rc-2

Mime
View raw message