kafka-dev mailing list archives

Site index · List index
Message view « Date » · « Thread »
Top « Date » · « Thread »
From Apache Jenkins Server <jenk...@builds.apache.org>
Subject Build failed in Jenkins: kafka-0.10.1-jdk7 #38
Date Sun, 02 Oct 2016 08:52:16 GMT
See <https://builds.apache.org/job/kafka-0.10.1-jdk7/38/changes>

Changes:

[wangguoz] KAFKA-4241: StreamsConfig doesn't pass through custom consumer and

------------------------------------------
[...truncated 6785 lines...]
kafka.common.ConfigTest > testInvalidClientIds PASSED

kafka.common.ZkNodeChangeNotificationListenerTest > testProcessNotification STARTED

kafka.common.ZkNodeChangeNotificationListenerTest > testProcessNotification PASSED

kafka.zk.ZKEphemeralTest > testOverlappingSessions[0] STARTED

kafka.zk.ZKEphemeralTest > testOverlappingSessions[0] PASSED

kafka.zk.ZKEphemeralTest > testEphemeralNodeCleanup[0] STARTED

kafka.zk.ZKEphemeralTest > testEphemeralNodeCleanup[0] PASSED

kafka.zk.ZKEphemeralTest > testZkWatchedEphemeral[0] STARTED

kafka.zk.ZKEphemeralTest > testZkWatchedEphemeral[0] PASSED

kafka.zk.ZKEphemeralTest > testSameSession[0] STARTED

kafka.zk.ZKEphemeralTest > testSameSession[0] PASSED

kafka.zk.ZKEphemeralTest > testOverlappingSessions[1] STARTED

kafka.zk.ZKEphemeralTest > testOverlappingSessions[1] PASSED

kafka.zk.ZKEphemeralTest > testEphemeralNodeCleanup[1] STARTED

kafka.zk.ZKEphemeralTest > testEphemeralNodeCleanup[1] PASSED

kafka.zk.ZKEphemeralTest > testZkWatchedEphemeral[1] STARTED

kafka.zk.ZKEphemeralTest > testZkWatchedEphemeral[1] PASSED

kafka.zk.ZKEphemeralTest > testSameSession[1] STARTED

kafka.zk.ZKEphemeralTest > testSameSession[1] PASSED

kafka.zk.ZKPathTest > testCreatePersistentSequentialThrowsException STARTED

kafka.zk.ZKPathTest > testCreatePersistentSequentialThrowsException PASSED

kafka.zk.ZKPathTest > testCreatePersistentSequentialExists STARTED

kafka.zk.ZKPathTest > testCreatePersistentSequentialExists PASSED

kafka.zk.ZKPathTest > testCreateEphemeralPathExists STARTED

kafka.zk.ZKPathTest > testCreateEphemeralPathExists PASSED

kafka.zk.ZKPathTest > testCreatePersistentPath STARTED

kafka.zk.ZKPathTest > testCreatePersistentPath PASSED

kafka.zk.ZKPathTest > testMakeSurePersistsPathExistsThrowsException STARTED

kafka.zk.ZKPathTest > testMakeSurePersistsPathExistsThrowsException PASSED

kafka.zk.ZKPathTest > testCreateEphemeralPathThrowsException STARTED

kafka.zk.ZKPathTest > testCreateEphemeralPathThrowsException PASSED

kafka.zk.ZKPathTest > testCreatePersistentPathThrowsException STARTED

kafka.zk.ZKPathTest > testCreatePersistentPathThrowsException PASSED

kafka.zk.ZKPathTest > testMakeSurePersistsPathExists STARTED

kafka.zk.ZKPathTest > testMakeSurePersistsPathExists PASSED

kafka.security.auth.OperationTest > testFromString STARTED

kafka.security.auth.OperationTest > testFromString PASSED

kafka.security.auth.ResourceTypeTest > testFromString STARTED

kafka.security.auth.ResourceTypeTest > testFromString PASSED

kafka.security.auth.ZkAuthorizationTest > testIsZkSecurityEnabled STARTED

kafka.security.auth.ZkAuthorizationTest > testIsZkSecurityEnabled PASSED

kafka.security.auth.ZkAuthorizationTest > testZkUtils STARTED

kafka.security.auth.ZkAuthorizationTest > testZkUtils PASSED

kafka.security.auth.ZkAuthorizationTest > testZkAntiMigration STARTED

kafka.security.auth.ZkAuthorizationTest > testZkAntiMigration PASSED

kafka.security.auth.ZkAuthorizationTest > testZkMigration STARTED

kafka.security.auth.ZkAuthorizationTest > testZkMigration PASSED

kafka.security.auth.ZkAuthorizationTest > testChroot STARTED

kafka.security.auth.ZkAuthorizationTest > testChroot PASSED

kafka.security.auth.ZkAuthorizationTest > testDelete STARTED

kafka.security.auth.ZkAuthorizationTest > testDelete PASSED

kafka.security.auth.ZkAuthorizationTest > testDeleteRecursive STARTED

kafka.security.auth.ZkAuthorizationTest > testDeleteRecursive PASSED

kafka.security.auth.PermissionTypeTest > testFromString STARTED

kafka.security.auth.PermissionTypeTest > testFromString PASSED

kafka.security.auth.AclTest > testAclJsonConversion STARTED

kafka.security.auth.AclTest > testAclJsonConversion PASSED

kafka.security.auth.SimpleAclAuthorizerTest > testAllowAllAccess STARTED

kafka.security.auth.SimpleAclAuthorizerTest > testAllowAllAccess PASSED

kafka.security.auth.SimpleAclAuthorizerTest > testLocalConcurrentModificationOfResourceAcls
STARTED

kafka.security.auth.SimpleAclAuthorizerTest > testLocalConcurrentModificationOfResourceAcls
PASSED

kafka.security.auth.SimpleAclAuthorizerTest > testHighConcurrencyDeletionOfResourceAcls
STARTED

kafka.security.auth.SimpleAclAuthorizerTest > testHighConcurrencyDeletionOfResourceAcls
PASSED

kafka.security.auth.SimpleAclAuthorizerTest > testNoAclFound STARTED

kafka.security.auth.SimpleAclAuthorizerTest > testNoAclFound PASSED

kafka.security.auth.SimpleAclAuthorizerTest > testDistributedConcurrentModificationOfResourceAcls
STARTED

kafka.security.auth.SimpleAclAuthorizerTest > testDistributedConcurrentModificationOfResourceAcls
PASSED

kafka.security.auth.SimpleAclAuthorizerTest > testAclManagementAPIs STARTED

kafka.security.auth.SimpleAclAuthorizerTest > testAclManagementAPIs PASSED

kafka.security.auth.SimpleAclAuthorizerTest > testWildCardAcls STARTED

kafka.security.auth.SimpleAclAuthorizerTest > testWildCardAcls PASSED

kafka.security.auth.SimpleAclAuthorizerTest > testTopicAcl STARTED

kafka.security.auth.SimpleAclAuthorizerTest > testTopicAcl PASSED

kafka.security.auth.SimpleAclAuthorizerTest > testSuperUserHasAccess STARTED

kafka.security.auth.SimpleAclAuthorizerTest > testSuperUserHasAccess PASSED

kafka.security.auth.SimpleAclAuthorizerTest > testDenyTakesPrecedence STARTED

kafka.security.auth.SimpleAclAuthorizerTest > testDenyTakesPrecedence PASSED

kafka.security.auth.SimpleAclAuthorizerTest > testNoAclFoundOverride STARTED

kafka.security.auth.SimpleAclAuthorizerTest > testNoAclFoundOverride PASSED

kafka.security.auth.SimpleAclAuthorizerTest > testHighConcurrencyModificationOfResourceAcls
STARTED

kafka.security.auth.SimpleAclAuthorizerTest > testHighConcurrencyModificationOfResourceAcls
PASSED

kafka.security.auth.SimpleAclAuthorizerTest > testLoadCache STARTED

kafka.security.auth.SimpleAclAuthorizerTest > testLoadCache PASSED

kafka.server.SaslSslReplicaFetchTest > testReplicaFetcherThread STARTED

kafka.server.SaslSslReplicaFetchTest > testReplicaFetcherThread PASSED

kafka.server.DeleteTopicsRequestTest > testValidDeleteTopicRequests STARTED

kafka.server.DeleteTopicsRequestTest > testValidDeleteTopicRequests PASSED

kafka.server.DeleteTopicsRequestTest > testErrorDeleteTopicRequests STARTED

kafka.server.DeleteTopicsRequestTest > testErrorDeleteTopicRequests PASSED

kafka.server.DeleteTopicsRequestTest > testNotController STARTED

kafka.server.DeleteTopicsRequestTest > testNotController PASSED

kafka.server.ReplicationQuotasTest > shouldBootstrapTwoBrokersWithLeaderThrottle STARTED

kafka.server.ReplicationQuotasTest > shouldBootstrapTwoBrokersWithLeaderThrottle FAILED
    java.lang.AssertionError: Offsets did not match for partition 1 on broker 101
        at org.junit.Assert.fail(Assert.java:88)
        at kafka.utils.TestUtils$.waitUntilTrue(TestUtils.scala:752)
        at kafka.server.ReplicationQuotasTest.kafka$server$ReplicationQuotasTest$$waitForOffsetsToMatch(ReplicationQuotasTest.scala:223)
        at kafka.server.ReplicationQuotasTest$$anonfun$shouldMatchQuotaReplicatingThroughAnAsymmetricTopology$3.apply$mcZI$sp(ReplicationQuotasTest.scala:130)
        at kafka.server.ReplicationQuotasTest$$anonfun$shouldMatchQuotaReplicatingThroughAnAsymmetricTopology$3.apply(ReplicationQuotasTest.scala:130)
        at kafka.server.ReplicationQuotasTest$$anonfun$shouldMatchQuotaReplicatingThroughAnAsymmetricTopology$3.apply(ReplicationQuotasTest.scala:130)
        at scala.collection.immutable.Range.foreach(Range.scala:160)
        at kafka.server.ReplicationQuotasTest.shouldMatchQuotaReplicatingThroughAnAsymmetricTopology(ReplicationQuotasTest.scala:130)
        at kafka.server.ReplicationQuotasTest.shouldBootstrapTwoBrokersWithLeaderThrottle(ReplicationQuotasTest.scala:68)

kafka.server.ReplicationQuotasTest > shouldThrottleOldSegments STARTED

kafka.server.ReplicationQuotasTest > shouldThrottleOldSegments PASSED

kafka.server.ReplicationQuotasTest > shouldBootstrapTwoBrokersWithFollowerThrottle STARTED

kafka.server.ReplicationQuotasTest > shouldBootstrapTwoBrokersWithFollowerThrottle PASSED

kafka.server.ReplicaManagerTest > testHighWaterMarkDirectoryMapping STARTED

kafka.server.ReplicaManagerTest > testHighWaterMarkDirectoryMapping PASSED

kafka.server.ReplicaManagerTest > testFetchBeyondHighWatermarkReturnEmptyResponse STARTED

kafka.server.ReplicaManagerTest > testFetchBeyondHighWatermarkReturnEmptyResponse PASSED

kafka.server.ReplicaManagerTest > testIllegalRequiredAcks STARTED

kafka.server.ReplicaManagerTest > testIllegalRequiredAcks PASSED

kafka.server.ReplicaManagerTest > testClearPurgatoryOnBecomingFollower STARTED

kafka.server.ReplicaManagerTest > testClearPurgatoryOnBecomingFollower PASSED

kafka.server.ReplicaManagerTest > testHighwaterMarkRelativeDirectoryMapping STARTED

kafka.server.ReplicaManagerTest > testHighwaterMarkRelativeDirectoryMapping PASSED

kafka.server.FetchRequestTest > testBrokerRespectsPartitionsOrderAndSizeLimits STARTED
ERROR: Could not install GRADLE_2_4_RC_2_HOME
java.lang.NullPointerException
Build timed out (after 180 minutes). Marking the build as failed.
Build was aborted
Recording test results

719 tests completed, 1 failed
:kafka-0.10.1-jdk7:core:test FAILED
:test_core_2_11 FAILED

FAILURE: Build failed with an exception.

* What went wrong:
Execution failed for task ':core:test'.
> Process 'Gradle Test Executor 2' finished with non-zero exit value 143

* Try:
Run with --stacktrace option to get the stack trace. Run with --info or --debug option to
get more log output.

BUILD FAILED

Total time: 2 hrs 59 mins 25.454 secs
Setting GRADLE_2_4_RC_2_HOME=/home/jenkins/jenkins-slave/tools/hudson.plugins.gradle.GradleInstallation/Gradle_2.4-rc-2
Setting GRADLE_2_4_RC_2_HOME=/home/jenkins/jenkins-slave/tools/hudson.plugins.gradle.GradleInstallation/Gradle_2.4-rc-2

Mime
View raw message