kafka-dev mailing list archives

Site index · List index
Message view « Date » · « Thread »
Top « Date » · « Thread »
From Apache Jenkins Server <jenk...@builds.apache.org>
Subject Build failed in Jenkins: kafka-trunk-jdk8 #1008
Date Fri, 28 Oct 2016 03:22:30 GMT
See <https://builds.apache.org/job/kafka-trunk-jdk8/1008/changes>

Changes:

[jason] KAFKA-4349; Handle 'PreparingRebalance' and 'AwaitingSync' states in

------------------------------------------
[...truncated 6328 lines...]

kafka.api.FetchRequestTest > testShuffle PASSED

kafka.api.AdminClientTest > testDescribeConsumerGroup STARTED

kafka.api.AdminClientTest > testDescribeConsumerGroup PASSED

kafka.api.AdminClientTest > testListGroups STARTED

kafka.api.AdminClientTest > testListGroups PASSED

kafka.api.AdminClientTest > testDescribeConsumerGroupForNonExistentGroup STARTED

kafka.api.AdminClientTest > testDescribeConsumerGroupForNonExistentGroup PASSED

kafka.api.AdminClientTest > testGetConsumerGroupSummary STARTED

kafka.api.AdminClientTest > testGetConsumerGroupSummary PASSED

kafka.api.test.ProducerCompressionTest > testCompression[0] STARTED

kafka.api.test.ProducerCompressionTest > testCompression[0] PASSED

kafka.api.test.ProducerCompressionTest > testCompression[1] STARTED

kafka.api.test.ProducerCompressionTest > testCompression[1] PASSED

kafka.api.test.ProducerCompressionTest > testCompression[2] STARTED

kafka.api.test.ProducerCompressionTest > testCompression[2] PASSED

kafka.api.test.ProducerCompressionTest > testCompression[3] STARTED

kafka.api.test.ProducerCompressionTest > testCompression[3] PASSED

kafka.api.SslConsumerTest > testCoordinatorFailover STARTED

kafka.api.SslConsumerTest > testCoordinatorFailover PASSED

kafka.api.SslConsumerTest > testSimpleConsumption STARTED

kafka.api.SslConsumerTest > testSimpleConsumption PASSED

kafka.api.ConsumerBounceTest > testSeekAndCommitWithBrokerFailures STARTED

kafka.api.ConsumerBounceTest > testSeekAndCommitWithBrokerFailures PASSED

kafka.api.ConsumerBounceTest > testConsumptionWithBrokerFailures STARTED

kafka.api.ConsumerBounceTest > testConsumptionWithBrokerFailures PASSED

kafka.api.SaslPlaintextConsumerTest > testCoordinatorFailover STARTED

kafka.api.SaslPlaintextConsumerTest > testCoordinatorFailover PASSED

kafka.api.SaslPlaintextConsumerTest > testSimpleConsumption STARTED

kafka.api.SaslPlaintextConsumerTest > testSimpleConsumption PASSED

kafka.api.AuthorizerIntegrationTest > testCommitWithTopicWrite STARTED

kafka.api.AuthorizerIntegrationTest > testCommitWithTopicWrite PASSED

kafka.api.AuthorizerIntegrationTest > testPatternSubscriptionWithTopicAndGroupRead STARTED

kafka.api.AuthorizerIntegrationTest > testPatternSubscriptionWithTopicAndGroupRead PASSED

kafka.api.AuthorizerIntegrationTest > testPatternSubscriptionWithNoTopicAccess STARTED

kafka.api.AuthorizerIntegrationTest > testPatternSubscriptionWithNoTopicAccess PASSED

kafka.api.AuthorizerIntegrationTest > testCreatePermissionNeededToReadFromNonExistentTopic
STARTED

kafka.api.AuthorizerIntegrationTest > testCreatePermissionNeededToReadFromNonExistentTopic
PASSED

kafka.api.AuthorizerIntegrationTest > testPatternSubscriptionWithTopicDescribeOnlyAndGroupRead
STARTED

kafka.api.AuthorizerIntegrationTest > testPatternSubscriptionWithTopicDescribeOnlyAndGroupRead
PASSED

kafka.api.AuthorizerIntegrationTest > testDeleteWithWildCardAuth STARTED

kafka.api.AuthorizerIntegrationTest > testDeleteWithWildCardAuth PASSED

kafka.api.AuthorizerIntegrationTest > testOffsetFetchWithNoAccess STARTED

kafka.api.AuthorizerIntegrationTest > testOffsetFetchWithNoAccess PASSED

kafka.api.AuthorizerIntegrationTest > testProduceWithTopicRead STARTED

kafka.api.AuthorizerIntegrationTest > testProduceWithTopicRead PASSED

kafka.api.AuthorizerIntegrationTest > testListOffsetsWithNoTopicAccess STARTED

kafka.api.AuthorizerIntegrationTest > testListOffsetsWithNoTopicAccess PASSED

kafka.api.AuthorizerIntegrationTest > testCreatePermissionNeededForWritingToNonExistentTopic
STARTED

kafka.api.AuthorizerIntegrationTest > testCreatePermissionNeededForWritingToNonExistentTopic
PASSED

kafka.api.AuthorizerIntegrationTest > testPatternSubscriptionMatchingInternalTopicWithDescribeOnlyPermission
STARTED

kafka.api.AuthorizerIntegrationTest > testPatternSubscriptionMatchingInternalTopicWithDescribeOnlyPermission
PASSED

kafka.api.AuthorizerIntegrationTest > testSimpleConsumeWithOffsetLookupAndNoGroupAccess
STARTED

kafka.api.AuthorizerIntegrationTest > testSimpleConsumeWithOffsetLookupAndNoGroupAccess
PASSED

kafka.api.AuthorizerIntegrationTest > testConsumeWithTopicDescribe STARTED

kafka.api.AuthorizerIntegrationTest > testConsumeWithTopicDescribe PASSED

kafka.api.AuthorizerIntegrationTest > testOffsetFetchWithNoTopicAccess STARTED

kafka.api.AuthorizerIntegrationTest > testOffsetFetchWithNoTopicAccess PASSED

kafka.api.AuthorizerIntegrationTest > testCommitWithNoTopicAccess STARTED

kafka.api.AuthorizerIntegrationTest > testCommitWithNoTopicAccess PASSED

kafka.api.AuthorizerIntegrationTest > testProduceWithNoTopicAccess STARTED

kafka.api.AuthorizerIntegrationTest > testProduceWithNoTopicAccess PASSED

kafka.api.AuthorizerIntegrationTest > testProduceWithTopicWrite STARTED

kafka.api.AuthorizerIntegrationTest > testProduceWithTopicWrite PASSED

kafka.api.AuthorizerIntegrationTest > testAuthorizationWithTopicNotExisting STARTED

kafka.api.AuthorizerIntegrationTest > testAuthorizationWithTopicNotExisting PASSED

kafka.api.AuthorizerIntegrationTest > testListOffsetsWithTopicDescribe STARTED

kafka.api.AuthorizerIntegrationTest > testListOffsetsWithTopicDescribe PASSED

kafka.api.AuthorizerIntegrationTest > testUnauthorizedDeleteWithDescribe STARTED

kafka.api.AuthorizerIntegrationTest > testUnauthorizedDeleteWithDescribe PASSED

kafka.api.AuthorizerIntegrationTest > testConsumeWithTopicAndGroupRead STARTED

kafka.api.AuthorizerIntegrationTest > testConsumeWithTopicAndGroupRead PASSED

kafka.api.AuthorizerIntegrationTest > testPatternSubscriptionNotMatchingInternalTopic STARTED

kafka.api.AuthorizerIntegrationTest > testPatternSubscriptionNotMatchingInternalTopic PASSED

kafka.api.AuthorizerIntegrationTest > testUnauthorizedDeleteWithoutDescribe STARTED

kafka.api.AuthorizerIntegrationTest > testUnauthorizedDeleteWithoutDescribe PASSED

kafka.api.AuthorizerIntegrationTest > testConsumeWithTopicWrite STARTED

kafka.api.AuthorizerIntegrationTest > testConsumeWithTopicWrite PASSED

kafka.api.AuthorizerIntegrationTest > testOffsetFetchWithNoGroupAccess STARTED

kafka.api.AuthorizerIntegrationTest > testOffsetFetchWithNoGroupAccess PASSED

kafka.api.AuthorizerIntegrationTest > testCommitWithNoAccess STARTED

kafka.api.AuthorizerIntegrationTest > testCommitWithNoAccess PASSED

kafka.api.AuthorizerIntegrationTest > testConsumeWithoutTopicDescribeAccess STARTED

kafka.api.AuthorizerIntegrationTest > testConsumeWithoutTopicDescribeAccess PASSED

kafka.api.AuthorizerIntegrationTest > testCommitWithNoGroupAccess STARTED

kafka.api.AuthorizerIntegrationTest > testCommitWithNoGroupAccess PASSED

kafka.api.AuthorizerIntegrationTest > testConsumeWithNoAccess STARTED

kafka.api.AuthorizerIntegrationTest > testConsumeWithNoAccess PASSED

kafka.api.AuthorizerIntegrationTest > testOffsetFetchWithTopicAndGroupRead STARTED

kafka.api.AuthorizerIntegrationTest > testOffsetFetchWithTopicAndGroupRead PASSED

kafka.api.AuthorizerIntegrationTest > testCommitWithTopicDescribe STARTED

kafka.api.AuthorizerIntegrationTest > testCommitWithTopicDescribe PASSED

kafka.api.AuthorizerIntegrationTest > testAuthorizationWithTopicExisting STARTED

kafka.api.AuthorizerIntegrationTest > testAuthorizationWithTopicExisting PASSED

kafka.api.AuthorizerIntegrationTest > testProduceWithTopicDescribe STARTED

kafka.api.AuthorizerIntegrationTest > testProduceWithTopicDescribe PASSED

kafka.api.AuthorizerIntegrationTest > testPatternSubscriptionMatchingInternalTopic STARTED

kafka.api.AuthorizerIntegrationTest > testPatternSubscriptionMatchingInternalTopic PASSED

kafka.api.AuthorizerIntegrationTest > testOffsetFetchTopicDescribe STARTED

kafka.api.AuthorizerIntegrationTest > testOffsetFetchTopicDescribe PASSED

kafka.api.AuthorizerIntegrationTest > testCommitWithTopicAndGroupRead STARTED

kafka.api.AuthorizerIntegrationTest > testCommitWithTopicAndGroupRead PASSED

kafka.api.AuthorizerIntegrationTest > testSimpleConsumeWithExplicitSeekAndNoGroupAccess
STARTED

kafka.api.AuthorizerIntegrationTest > testSimpleConsumeWithExplicitSeekAndNoGroupAccess
PASSED

kafka.api.ProducerBounceTest > testBrokerFailure STARTED

kafka.api.ProducerBounceTest > testBrokerFailure PASSED

kafka.api.SaslMultiMechanismConsumerTest > testMultipleBrokerMechanisms STARTED

kafka.api.SaslMultiMechanismConsumerTest > testMultipleBrokerMechanisms PASSED

kafka.api.SaslMultiMechanismConsumerTest > testCoordinatorFailover STARTED

kafka.api.SaslMultiMechanismConsumerTest > testCoordinatorFailover PASSED

kafka.api.SaslMultiMechanismConsumerTest > testSimpleConsumption STARTED

kafka.api.SaslMultiMechanismConsumerTest > testSimpleConsumption PASSED

kafka.api.SaslSslEndToEndAuthorizationTest > testNoConsumeWithoutDescribeAclViaSubscribe
STARTED

kafka.api.SaslSslEndToEndAuthorizationTest > testNoConsumeWithoutDescribeAclViaSubscribe
PASSED

kafka.api.SaslSslEndToEndAuthorizationTest > testProduceConsumeViaAssign STARTED

578 tests completed, 1 failed
:kafka-trunk-jdk8:core:test FAILED
:test_core_2_11 FAILED

FAILURE: Build failed with an exception.

* What went wrong:
Execution failed for task ':core:test'.
> Process 'Gradle Test Executor 2' finished with non-zero exit value 137

* Try:
Run with --stacktrace option to get the stack trace. Run with --info or --debug option to
get more log output.

BUILD FAILED

Total time: 54 mins 53.468 secs
Build step 'Execute shell' marked build as failure
Recording test results
Setting GRADLE_2_4_RC_2_HOME=/home/jenkins/jenkins-slave/tools/hudson.plugins.gradle.GradleInstallation/Gradle_2.4-rc-2
Setting GRADLE_2_4_RC_2_HOME=/home/jenkins/jenkins-slave/tools/hudson.plugins.gradle.GradleInstallation/Gradle_2.4-rc-2

Mime
View raw message