kafka-dev mailing list archives

Site index · List index
Message view « Date » · « Thread »
Top « Date » · « Thread »
From Apache Jenkins Server <jenk...@builds.apache.org>
Subject Build failed in Jenkins: kafka-trunk-jdk7 #1606
Date Fri, 07 Oct 2016 00:25:22 GMT
See <https://builds.apache.org/job/kafka-trunk-jdk7/1606/changes>

Changes:

[jason] KAFKA-4252; Fix purgatory metric name in documentation

------------------------------------------
[...truncated 2425 lines...]
kafka.api.AdminClientTest > testDescribeConsumerGroup STARTED

kafka.api.AdminClientTest > testDescribeConsumerGroup PASSED

kafka.api.AdminClientTest > testListGroups STARTED

kafka.api.AdminClientTest > testListGroups PASSED

kafka.api.AdminClientTest > testDescribeConsumerGroupForNonExistentGroup STARTED

kafka.api.AdminClientTest > testDescribeConsumerGroupForNonExistentGroup PASSED

kafka.api.ProducerBounceTest > testBrokerFailure STARTED

kafka.api.ProducerBounceTest > testBrokerFailure PASSED

kafka.api.ClientIdQuotaTest > testProducerConsumerOverrideUnthrottled STARTED

kafka.api.ClientIdQuotaTest > testProducerConsumerOverrideUnthrottled PASSED

kafka.api.ClientIdQuotaTest > testThrottledProducerConsumer STARTED

kafka.api.ClientIdQuotaTest > testThrottledProducerConsumer PASSED

kafka.api.ClientIdQuotaTest > testQuotaOverrideDelete STARTED

kafka.api.ClientIdQuotaTest > testQuotaOverrideDelete PASSED

kafka.api.test.ProducerCompressionTest > testCompression[0] STARTED

kafka.api.test.ProducerCompressionTest > testCompression[0] PASSED

kafka.api.test.ProducerCompressionTest > testCompression[1] STARTED

kafka.api.test.ProducerCompressionTest > testCompression[1] PASSED

kafka.api.test.ProducerCompressionTest > testCompression[2] STARTED

kafka.api.test.ProducerCompressionTest > testCompression[2] PASSED

kafka.api.test.ProducerCompressionTest > testCompression[3] STARTED

kafka.api.test.ProducerCompressionTest > testCompression[3] PASSED

kafka.api.SaslPlainSslEndToEndAuthorizationTest > testNoConsumeWithoutDescribeAclViaSubscribe
STARTED

kafka.api.SaslPlainSslEndToEndAuthorizationTest > testNoConsumeWithoutDescribeAclViaSubscribe
PASSED

kafka.api.SaslPlainSslEndToEndAuthorizationTest > testProduceConsumeViaAssign STARTED

kafka.api.SaslPlainSslEndToEndAuthorizationTest > testProduceConsumeViaAssign PASSED

kafka.api.SaslPlainSslEndToEndAuthorizationTest > testNoConsumeWithDescribeAclViaAssign
STARTED

kafka.api.SaslPlainSslEndToEndAuthorizationTest > testNoConsumeWithDescribeAclViaAssign
PASSED

kafka.api.SaslPlainSslEndToEndAuthorizationTest > testNoConsumeWithDescribeAclViaSubscribe
STARTED

kafka.api.SaslPlainSslEndToEndAuthorizationTest > testNoConsumeWithDescribeAclViaSubscribe
PASSED

kafka.api.SaslPlainSslEndToEndAuthorizationTest > testNoConsumeWithoutDescribeAclViaAssign
STARTED

kafka.api.SaslPlainSslEndToEndAuthorizationTest > testNoConsumeWithoutDescribeAclViaAssign
PASSED

kafka.api.SaslPlainSslEndToEndAuthorizationTest > testNoGroupAcl STARTED

kafka.api.SaslPlainSslEndToEndAuthorizationTest > testNoGroupAcl PASSED

kafka.api.SaslPlainSslEndToEndAuthorizationTest > testNoProduceWithDescribeAcl STARTED

kafka.api.SaslPlainSslEndToEndAuthorizationTest > testNoProduceWithDescribeAcl PASSED

kafka.api.SaslPlainSslEndToEndAuthorizationTest > testProduceConsumeViaSubscribe STARTED

kafka.api.SaslPlainSslEndToEndAuthorizationTest > testProduceConsumeViaSubscribe PASSED

kafka.api.SaslPlainSslEndToEndAuthorizationTest > testNoProduceWithoutDescribeAcl STARTED

kafka.api.SaslPlainSslEndToEndAuthorizationTest > testNoProduceWithoutDescribeAcl PASSED

kafka.api.ConsumerBounceTest > testSeekAndCommitWithBrokerFailures STARTED

kafka.api.ConsumerBounceTest > testSeekAndCommitWithBrokerFailures PASSED

kafka.api.ConsumerBounceTest > testConsumptionWithBrokerFailures STARTED

kafka.api.ConsumerBounceTest > testConsumptionWithBrokerFailures PASSED

kafka.api.SaslPlaintextConsumerTest > testCoordinatorFailover STARTED

kafka.api.SaslPlaintextConsumerTest > testCoordinatorFailover PASSED

kafka.api.SaslPlaintextConsumerTest > testSimpleConsumption STARTED

kafka.api.SaslPlaintextConsumerTest > testSimpleConsumption PASSED

kafka.api.SaslMultiMechanismConsumerTest > testMultipleBrokerMechanisms STARTED

kafka.api.SaslMultiMechanismConsumerTest > testMultipleBrokerMechanisms PASSED

kafka.api.SaslMultiMechanismConsumerTest > testCoordinatorFailover STARTED

kafka.api.SaslMultiMechanismConsumerTest > testCoordinatorFailover PASSED

kafka.api.SaslMultiMechanismConsumerTest > testSimpleConsumption STARTED

kafka.api.SaslMultiMechanismConsumerTest > testSimpleConsumption PASSED

kafka.api.FetchRequestTest > testShuffleWithSingleTopic STARTED

kafka.api.FetchRequestTest > testShuffleWithSingleTopic PASSED

kafka.api.FetchRequestTest > testShuffle STARTED

kafka.api.FetchRequestTest > testShuffle PASSED

kafka.api.UserClientIdQuotaTest > testProducerConsumerOverrideUnthrottled STARTED

kafka.api.UserClientIdQuotaTest > testProducerConsumerOverrideUnthrottled PASSED

kafka.api.UserClientIdQuotaTest > testThrottledProducerConsumer STARTED

kafka.api.UserClientIdQuotaTest > testThrottledProducerConsumer PASSED

kafka.api.UserClientIdQuotaTest > testQuotaOverrideDelete STARTED

kafka.api.UserClientIdQuotaTest > testQuotaOverrideDelete PASSED

kafka.api.SslProducerSendTest > testSendNonCompressedMessageWithCreateTime STARTED

kafka.api.SslProducerSendTest > testSendNonCompressedMessageWithCreateTime PASSED

kafka.api.SslProducerSendTest > testClose STARTED

kafka.api.SslProducerSendTest > testClose PASSED

kafka.api.SslProducerSendTest > testFlush STARTED

kafka.api.SslProducerSendTest > testFlush PASSED

kafka.api.SslProducerSendTest > testSendToPartition STARTED

kafka.api.SslProducerSendTest > testSendToPartition PASSED

kafka.api.SslProducerSendTest > testSendOffset STARTED

kafka.api.SslProducerSendTest > testSendOffset PASSED

kafka.api.SslProducerSendTest > testSendCompressedMessageWithCreateTime STARTED

kafka.api.SslProducerSendTest > testSendCompressedMessageWithCreateTime PASSED

kafka.api.SslProducerSendTest > testCloseWithZeroTimeoutFromCallerThread STARTED

kafka.api.SslProducerSendTest > testCloseWithZeroTimeoutFromCallerThread PASSED

kafka.api.SslProducerSendTest > testCloseWithZeroTimeoutFromSenderThread STARTED

kafka.api.SslProducerSendTest > testCloseWithZeroTimeoutFromSenderThread PASSED

kafka.api.PlaintextConsumerTest > testEarliestOrLatestOffsets STARTED

kafka.api.PlaintextConsumerTest > testEarliestOrLatestOffsets PASSED

kafka.api.PlaintextConsumerTest > testPartitionsForAutoCreate STARTED

kafka.api.PlaintextConsumerTest > testPartitionsForAutoCreate PASSED

kafka.api.PlaintextConsumerTest > testShrinkingTopicSubscriptions STARTED

kafka.api.PlaintextConsumerTest > testShrinkingTopicSubscriptions PASSED

kafka.api.PlaintextConsumerTest > testMaxPollIntervalMs STARTED

kafka.api.PlaintextConsumerTest > testMaxPollIntervalMs PASSED

kafka.api.PlaintextConsumerTest > testOffsetsForTimes STARTED

kafka.api.PlaintextConsumerTest > testOffsetsForTimes PASSED

kafka.api.PlaintextConsumerTest > testSubsequentPatternSubscription STARTED

kafka.api.PlaintextConsumerTest > testSubsequentPatternSubscription PASSED

kafka.api.PlaintextConsumerTest > testAsyncCommit STARTED

kafka.api.PlaintextConsumerTest > testAsyncCommit PASSED

kafka.api.PlaintextConsumerTest > testLowMaxFetchSizeForRequestAndPartition STARTED
ERROR: Could not install GRADLE_2_4_RC_2_HOME
java.lang.NullPointerException
	at hudson.plugins.toolenv.ToolEnvBuildWrapper$1.buildEnvVars(ToolEnvBuildWrapper.java:46)
	at hudson.model.AbstractBuild.getEnvironment(AbstractBuild.java:931)
	at hudson.plugins.git.GitSCM.getParamExpandedRepos(GitSCM.java:404)
	at hudson.plugins.git.GitSCM.compareRemoteRevisionWithImpl(GitSCM.java:609)
	at hudson.plugins.git.GitSCM.compareRemoteRevisionWith(GitSCM.java:574)
	at hudson.scm.SCM.compareRemoteRevisionWith(SCM.java:381)
	at hudson.scm.SCM.poll(SCM.java:398)
	at hudson.model.AbstractProject._poll(AbstractProject.java:1446)
	at hudson.model.AbstractProject.poll(AbstractProject.java:1349)
	at hudson.triggers.SCMTrigger$Runner.runPolling(SCMTrigger.java:528)
	at hudson.triggers.SCMTrigger$Runner.run(SCMTrigger.java:557)
	at hudson.util.SequentialExecutionQueue$QueueEntry.run(SequentialExecutionQueue.java:119)
	at java.util.concurrent.Executors$RunnableAdapter.call(Executors.java:511)
	at java.util.concurrent.FutureTask.run(FutureTask.java:266)
	at java.util.concurrent.ThreadPoolExecutor.runWorker(ThreadPoolExecutor.java:1142)
	at java.util.concurrent.ThreadPoolExecutor$Worker.run(ThreadPoolExecutor.java:617)
	at java.lang.Thread.run(Thread.java:745)
ERROR: Could not install GRADLE_2_4_RC_2_HOME
java.lang.NullPointerException
	at hudson.plugins.toolenv.ToolEnvBuildWrapper$1.buildEnvVars(ToolEnvBuildWrapper.java:46)
	at hudson.model.AbstractBuild.getEnvironment(AbstractBuild.java:931)
	at hudson.plugins.git.GitSCM.getParamExpandedRepos(GitSCM.java:404)
	at hudson.plugins.git.GitSCM.compareRemoteRevisionWithImpl(GitSCM.java:609)
	at hudson.plugins.git.GitSCM.compareRemoteRevisionWith(GitSCM.java:574)
	at hudson.scm.SCM.compareRemoteRevisionWith(SCM.java:381)
	at hudson.scm.SCM.poll(SCM.java:398)
	at hudson.model.AbstractProject._poll(AbstractProject.java:1446)
	at hudson.model.AbstractProject.poll(AbstractProject.java:1349)
	at hudson.triggers.SCMTrigger$Runner.runPolling(SCMTrigger.java:528)
	at hudson.triggers.SCMTrigger$Runner.run(SCMTrigger.java:557)
	at hudson.util.SequentialExecutionQueue$QueueEntry.run(SequentialExecutionQueue.java:119)
	at java.util.concurrent.Executors$RunnableAdapter.call(Executors.java:511)
	at java.util.concurrent.FutureTask.run(FutureTask.java:266)
	at java.util.concurrent.ThreadPoolExecutor.runWorker(ThreadPoolExecutor.java:1142)
	at java.util.concurrent.ThreadPoolExecutor$Worker.run(ThreadPoolExecutor.java:617)
	at java.lang.Thread.run(Thread.java:745)

606 tests completed, 1 failed
:kafka-trunk-jdk7:core:test FAILED
:test_core_2_10 FAILED

FAILURE: Build failed with an exception.

* What went wrong:
Execution failed for task ':core:test'.
> Process 'Gradle Test Executor 2' finished with non-zero exit value 1

* Try:
Run with --stacktrace option to get the stack trace. Run with --info or --debug option to
get more log output.

BUILD FAILED

Total time: 3 hrs 45 mins 6.29 secs
Build step 'Execute shell' marked build as failure
Recording test results
Setting GRADLE_2_4_RC_2_HOME=/home/jenkins/jenkins-slave/tools/hudson.plugins.gradle.GradleInstallation/Gradle_2.4-rc-2
ERROR: Step ?Publish JUnit test result report? failed: No test report files were found. Configuration
error?
Setting GRADLE_2_4_RC_2_HOME=/home/jenkins/jenkins-slave/tools/hudson.plugins.gradle.GradleInstallation/Gradle_2.4-rc-2

Mime
View raw message