kafka-dev mailing list archives

Site index · List index
Message view « Date » · « Thread »
Top « Date » · « Thread »
From Apache Jenkins Server <jenk...@builds.apache.org>
Subject Build failed in Jenkins: kafka-trunk-jdk7 #1555
Date Mon, 19 Sep 2016 23:49:36 GMT
See <https://builds.apache.org/job/kafka-trunk-jdk7/1555/changes>

Changes:

[junrao] KAFKA-4079; Documentation for secure quotas

[wangguoz] MINOR: Allow creation of statestore without logging enabled or explicit

[jason] KAFKA-4183; Centralize checking for optional and default values in

[jason] MINOR: Add KafkaServerStartable constructor overload for compatibility

[jason] KAFKA-3283; Remove beta from new consumer documentation

------------------------------------------
[...truncated 3562 lines...]

kafka.api.AuthorizerIntegrationTest > testOffsetFetchWithNoTopicAccess STARTED

kafka.api.AuthorizerIntegrationTest > testOffsetFetchWithNoTopicAccess PASSED

kafka.api.AuthorizerIntegrationTest > testCommitWithNoTopicAccess STARTED

kafka.api.AuthorizerIntegrationTest > testCommitWithNoTopicAccess PASSED

kafka.api.AuthorizerIntegrationTest > testProduceWithNoTopicAccess STARTED

kafka.api.AuthorizerIntegrationTest > testProduceWithNoTopicAccess PASSED

kafka.api.AuthorizerIntegrationTest > testProduceWithTopicWrite STARTED

kafka.api.AuthorizerIntegrationTest > testProduceWithTopicWrite PASSED

kafka.api.AuthorizerIntegrationTest > testAuthorization STARTED

kafka.api.AuthorizerIntegrationTest > testAuthorization PASSED

kafka.api.AuthorizerIntegrationTest > testUnauthorizedDeleteWithDescribe STARTED

kafka.api.AuthorizerIntegrationTest > testUnauthorizedDeleteWithDescribe PASSED

kafka.api.AuthorizerIntegrationTest > testConsumeWithTopicAndGroupRead STARTED

kafka.api.AuthorizerIntegrationTest > testConsumeWithTopicAndGroupRead PASSED

kafka.api.AuthorizerIntegrationTest > testUnauthorizedDeleteWithoutDescribe STARTED

kafka.api.AuthorizerIntegrationTest > testUnauthorizedDeleteWithoutDescribe PASSED

kafka.api.AuthorizerIntegrationTest > testConsumeWithTopicWrite STARTED

kafka.api.AuthorizerIntegrationTest > testConsumeWithTopicWrite PASSED

kafka.api.AuthorizerIntegrationTest > testOffsetFetchWithNoGroupAccess STARTED

kafka.api.AuthorizerIntegrationTest > testOffsetFetchWithNoGroupAccess PASSED

kafka.api.AuthorizerIntegrationTest > testCommitWithNoAccess STARTED

kafka.api.AuthorizerIntegrationTest > testCommitWithNoAccess PASSED

kafka.api.AuthorizerIntegrationTest > testCommitWithNoGroupAccess STARTED

kafka.api.AuthorizerIntegrationTest > testCommitWithNoGroupAccess PASSED

kafka.api.AuthorizerIntegrationTest > testConsumeWithNoAccess STARTED

kafka.api.AuthorizerIntegrationTest > testConsumeWithNoAccess PASSED

kafka.api.AuthorizerIntegrationTest > testOffsetFetchWithTopicAndGroupRead STARTED

kafka.api.AuthorizerIntegrationTest > testOffsetFetchWithTopicAndGroupRead PASSED

kafka.api.AuthorizerIntegrationTest > testCommitWithTopicDescribe STARTED

kafka.api.AuthorizerIntegrationTest > testCommitWithTopicDescribe PASSED

kafka.api.AuthorizerIntegrationTest > testProduceWithTopicDescribe STARTED

kafka.api.AuthorizerIntegrationTest > testProduceWithTopicDescribe PASSED

kafka.api.AuthorizerIntegrationTest > testOffsetFetchTopicDescribe STARTED

kafka.api.AuthorizerIntegrationTest > testOffsetFetchTopicDescribe PASSED

kafka.api.AuthorizerIntegrationTest > testCommitWithTopicAndGroupRead STARTED

kafka.api.AuthorizerIntegrationTest > testCommitWithTopicAndGroupRead PASSED

kafka.api.AuthorizerIntegrationTest > testSimpleConsumeWithExplicitSeekAndNoGroupAccess
STARTED

kafka.api.AuthorizerIntegrationTest > testSimpleConsumeWithExplicitSeekAndNoGroupAccess
PASSED

kafka.api.SaslPlainPlaintextConsumerTest > testCoordinatorFailover STARTED

kafka.api.SaslPlainPlaintextConsumerTest > testCoordinatorFailover PASSED

kafka.api.SaslPlainPlaintextConsumerTest > testSimpleConsumption STARTED

kafka.api.SaslPlainPlaintextConsumerTest > testSimpleConsumption PASSED

kafka.api.RequestResponseSerializationTest > testSerializationAndDeserialization STARTED

kafka.api.RequestResponseSerializationTest > testSerializationAndDeserialization PASSED

kafka.api.RequestResponseSerializationTest > testFetchResponseVersion STARTED

kafka.api.RequestResponseSerializationTest > testFetchResponseVersion PASSED

kafka.api.RequestResponseSerializationTest > testProduceResponseVersion STARTED

kafka.api.RequestResponseSerializationTest > testProduceResponseVersion PASSED

kafka.api.SaslPlainSslEndToEndAuthorizationTest > testNoConsumeAcl STARTED

kafka.api.SaslPlainSslEndToEndAuthorizationTest > testNoConsumeAcl PASSED

kafka.api.SaslPlainSslEndToEndAuthorizationTest > testProduceConsumeViaAssign STARTED

kafka.api.SaslPlainSslEndToEndAuthorizationTest > testProduceConsumeViaAssign PASSED

kafka.api.SaslPlainSslEndToEndAuthorizationTest > testNoProduceAcl STARTED

kafka.api.SaslPlainSslEndToEndAuthorizationTest > testNoProduceAcl PASSED

kafka.api.SaslPlainSslEndToEndAuthorizationTest > testNoGroupAcl STARTED

kafka.api.SaslPlainSslEndToEndAuthorizationTest > testNoGroupAcl PASSED

kafka.api.SaslPlainSslEndToEndAuthorizationTest > testProduceConsumeViaSubscribe STARTED

kafka.api.SaslPlainSslEndToEndAuthorizationTest > testProduceConsumeViaSubscribe PASSED

kafka.api.SaslSslConsumerTest > testCoordinatorFailover STARTED

kafka.api.SaslSslConsumerTest > testCoordinatorFailover PASSED

kafka.api.SaslSslConsumerTest > testSimpleConsumption STARTED

kafka.api.SaslSslConsumerTest > testSimpleConsumption PASSED

kafka.api.test.ProducerCompressionTest > testCompression[0] STARTED

kafka.api.test.ProducerCompressionTest > testCompression[0] PASSED

kafka.api.test.ProducerCompressionTest > testCompression[1] STARTED

kafka.api.test.ProducerCompressionTest > testCompression[1] PASSED

kafka.api.test.ProducerCompressionTest > testCompression[2] STARTED

kafka.api.test.ProducerCompressionTest > testCompression[2] PASSED

kafka.api.test.ProducerCompressionTest > testCompression[3] STARTED

kafka.api.test.ProducerCompressionTest > testCompression[3] PASSED

kafka.controller.ControllerFailoverTest > testMetadataUpdate STARTED

kafka.controller.ControllerFailoverTest > testMetadataUpdate PASSED

kafka.tools.MirrorMakerTest > testDefaultMirrorMakerMessageHandlerWithNoTimestampInSourceMessage
STARTED

kafka.tools.MirrorMakerTest > testDefaultMirrorMakerMessageHandlerWithNoTimestampInSourceMessage
PASSED

kafka.tools.MirrorMakerTest > testDefaultMirrorMakerMessageHandler STARTED

kafka.tools.MirrorMakerTest > testDefaultMirrorMakerMessageHandler PASSED

kafka.tools.ConsoleProducerTest > testParseKeyProp STARTED

kafka.tools.ConsoleProducerTest > testParseKeyProp PASSED

kafka.tools.ConsoleProducerTest > testValidConfigsOldProducer STARTED

kafka.tools.ConsoleProducerTest > testValidConfigsOldProducer PASSED

kafka.tools.ConsoleProducerTest > testInvalidConfigs STARTED

kafka.tools.ConsoleProducerTest > testInvalidConfigs PASSED

kafka.tools.ConsoleProducerTest > testValidConfigsNewProducer STARTED

kafka.tools.ConsoleProducerTest > testValidConfigsNewProducer PASSED

kafka.tools.ConsoleConsumerTest > shouldLimitReadsToMaxMessageLimit STARTED

kafka.tools.ConsoleConsumerTest > shouldLimitReadsToMaxMessageLimit PASSED

kafka.tools.ConsoleConsumerTest > shouldParseValidNewConsumerValidConfig STARTED

kafka.tools.ConsoleConsumerTest > shouldParseValidNewConsumerValidConfig PASSED

kafka.tools.ConsoleConsumerTest > shouldStopWhenOutputCheckErrorFails STARTED

kafka.tools.ConsoleConsumerTest > shouldStopWhenOutputCheckErrorFails PASSED

kafka.tools.ConsoleConsumerTest > shouldParseValidNewSimpleConsumerValidConfigWithStringOffset
STARTED

kafka.tools.ConsoleConsumerTest > shouldParseValidNewSimpleConsumerValidConfigWithStringOffset
PASSED

kafka.tools.ConsoleConsumerTest > shouldParseConfigsFromFile STARTED

kafka.tools.ConsoleConsumerTest > shouldParseConfigsFromFile PASSED

kafka.tools.ConsoleConsumerTest > shouldParseValidNewSimpleConsumerValidConfigWithNumericOffset
STARTED

kafka.tools.ConsoleConsumerTest > shouldParseValidNewSimpleConsumerValidConfigWithNumericOffset
PASSED

kafka.tools.ConsoleConsumerTest > shouldParseValidOldConsumerValidConfig STARTED

kafka.tools.ConsoleConsumerTest > shouldParseValidOldConsumerValidConfig PASSED

unit.kafka.server.ApiVersionsTest > testApiVersions STARTED

unit.kafka.server.ApiVersionsTest > testApiVersions PASSED

unit.kafka.server.ReplicationQuotaManagerTest > shouldThrottleOnlyDefinedReplicas STARTED

unit.kafka.server.ReplicationQuotaManagerTest > shouldThrottleOnlyDefinedReplicas PASSED

unit.kafka.server.ReplicationQuotaManagerTest > shouldSupportWildcardThrottledReplicas
STARTED

unit.kafka.server.ReplicationQuotaManagerTest > shouldSupportWildcardThrottledReplicas
PASSED

unit.kafka.server.ReplicationQuotaManagerTest > shouldExceedQuotaThenReturnBackBelowBoundAsTimePasses
STARTED

unit.kafka.server.ReplicationQuotaManagerTest > shouldExceedQuotaThenReturnBackBelowBoundAsTimePasses
PASSED

unit.kafka.server.ReplicationQuotasTest > shouldBootstrapTwoBrokersWithLeaderThrottle STARTED

unit.kafka.server.ReplicationQuotasTest > shouldBootstrapTwoBrokersWithLeaderThrottle PASSED

unit.kafka.server.ReplicationQuotasTest > shouldThrottleOldSegments STARTED

unit.kafka.server.ReplicationQuotasTest > shouldThrottleOldSegments PASSED

unit.kafka.server.ReplicationQuotasTest > shouldBootstrapTwoBrokersWithFollowerThrottle
STARTED

unit.kafka.server.ReplicationQuotasTest > shouldBootstrapTwoBrokersWithFollowerThrottle
PASSED

integration.kafka.api.GroupCoordinatorIntegrationTest > testGroupCoordinatorPropagatesOfffsetsTopicCompressionCodec
STARTED

integration.kafka.api.GroupCoordinatorIntegrationTest > testGroupCoordinatorPropagatesOfffsetsTopicCompressionCodec
PASSED

912 tests completed, 1 failed
:kafka-trunk-jdk7:core:test FAILED
:test_core_2_10 FAILED

FAILURE: Build failed with an exception.

* What went wrong:
Execution failed for task ':core:test'.
> There were failing tests. See the report at: file://<https://builds.apache.org/job/kafka-trunk-jdk7/ws/core/build/reports/tests/test/index.html>

* Try:
Run with --stacktrace option to get the stack trace. Run with --info or --debug option to
get more log output.

BUILD FAILED

Total time: 1 hrs 12 mins 43.383 secs
Build step 'Execute shell' marked build as failure
Recording test results
Setting GRADLE_2_4_RC_2_HOME=/home/jenkins/jenkins-slave/tools/hudson.plugins.gradle.GradleInstallation/Gradle_2.4-rc-2
Setting GRADLE_2_4_RC_2_HOME=/home/jenkins/jenkins-slave/tools/hudson.plugins.gradle.GradleInstallation/Gradle_2.4-rc-2

Mime
View raw message