kafka-dev mailing list archives

Site index · List index
Message view « Date » · « Thread »
Top « Date » · « Thread »
From Apache Jenkins Server <jenk...@builds.apache.org>
Subject Build failed in Jenkins: kafka-trunk-jdk7 #1559
Date Tue, 20 Sep 2016 13:59:58 GMT
See <https://builds.apache.org/job/kafka-trunk-jdk7/1559/changes>

Changes:

[ismael] HOTFIX: Added check for metadata unavailable

------------------------------------------
[...truncated 7259 lines...]

kafka.api.ProducerFailureHandlingTest > testTooLargeRecordWithAckOne STARTED

kafka.api.ProducerFailureHandlingTest > testTooLargeRecordWithAckOne PASSED

kafka.api.ProducerFailureHandlingTest > testWrongBrokerList STARTED

kafka.api.ProducerFailureHandlingTest > testWrongBrokerList PASSED

kafka.api.ProducerFailureHandlingTest > testNotEnoughReplicas STARTED

kafka.api.ProducerFailureHandlingTest > testNotEnoughReplicas PASSED

kafka.api.ProducerFailureHandlingTest > testResponseTooLargeForReplicationWithAckAll STARTED

kafka.api.ProducerFailureHandlingTest > testResponseTooLargeForReplicationWithAckAll PASSED

kafka.api.ProducerFailureHandlingTest > testNonExistentTopic STARTED

kafka.api.ProducerFailureHandlingTest > testNonExistentTopic PASSED

kafka.api.ProducerFailureHandlingTest > testInvalidPartition STARTED

kafka.api.ProducerFailureHandlingTest > testInvalidPartition PASSED

kafka.api.ProducerFailureHandlingTest > testSendAfterClosed STARTED

kafka.api.ProducerFailureHandlingTest > testSendAfterClosed PASSED

kafka.api.ProducerFailureHandlingTest > testTooLargeRecordWithAckZero STARTED

kafka.api.ProducerFailureHandlingTest > testTooLargeRecordWithAckZero PASSED

kafka.api.ProducerFailureHandlingTest > testPartitionTooLargeForReplicationWithAckAll STARTED

kafka.api.ProducerFailureHandlingTest > testPartitionTooLargeForReplicationWithAckAll PASSED

kafka.api.ProducerFailureHandlingTest > testNotEnoughReplicasAfterBrokerShutdown STARTED

kafka.api.ProducerFailureHandlingTest > testNotEnoughReplicasAfterBrokerShutdown PASSED

kafka.api.RackAwareAutoTopicCreationTest > testAutoCreateTopic STARTED

kafka.api.RackAwareAutoTopicCreationTest > testAutoCreateTopic PASSED

kafka.api.SaslPlaintextConsumerTest > testCoordinatorFailover STARTED

kafka.api.SaslPlaintextConsumerTest > testCoordinatorFailover PASSED

kafka.api.SaslPlaintextConsumerTest > testSimpleConsumption STARTED

kafka.api.SaslPlaintextConsumerTest > testSimpleConsumption PASSED

kafka.api.SslConsumerTest > testCoordinatorFailover STARTED

kafka.api.SslConsumerTest > testCoordinatorFailover PASSED

kafka.api.SslConsumerTest > testSimpleConsumption STARTED

kafka.api.SslConsumerTest > testSimpleConsumption PASSED

kafka.api.ConsumerBounceTest > testSeekAndCommitWithBrokerFailures STARTED

kafka.api.ConsumerBounceTest > testSeekAndCommitWithBrokerFailures PASSED

kafka.api.ConsumerBounceTest > testConsumptionWithBrokerFailures STARTED

kafka.api.ConsumerBounceTest > testConsumptionWithBrokerFailures PASSED

kafka.api.AuthorizerIntegrationTest > testCommitWithTopicWrite STARTED

kafka.api.AuthorizerIntegrationTest > testCommitWithTopicWrite PASSED

kafka.api.AuthorizerIntegrationTest > testConsumeWithNoTopicAccess STARTED

kafka.api.AuthorizerIntegrationTest > testConsumeWithNoTopicAccess PASSED

kafka.api.AuthorizerIntegrationTest > testCreatePermissionNeededToReadFromNonExistentTopic
STARTED

kafka.api.AuthorizerIntegrationTest > testCreatePermissionNeededToReadFromNonExistentTopic
PASSED

kafka.api.AuthorizerIntegrationTest > testDeleteWithWildCardAuth STARTED

kafka.api.AuthorizerIntegrationTest > testDeleteWithWildCardAuth PASSED

kafka.api.AuthorizerIntegrationTest > testOffsetFetchWithNoAccess STARTED

kafka.api.AuthorizerIntegrationTest > testOffsetFetchWithNoAccess PASSED

kafka.api.AuthorizerIntegrationTest > testListOfsetsWithTopicDescribe STARTED

kafka.api.AuthorizerIntegrationTest > testListOfsetsWithTopicDescribe PASSED

kafka.api.AuthorizerIntegrationTest > testProduceWithTopicRead STARTED

kafka.api.AuthorizerIntegrationTest > testProduceWithTopicRead PASSED

kafka.api.AuthorizerIntegrationTest > testListOffsetsWithNoTopicAccess STARTED

kafka.api.AuthorizerIntegrationTest > testListOffsetsWithNoTopicAccess PASSED

kafka.api.AuthorizerIntegrationTest > testCreatePermissionNeededForWritingToNonExistentTopic
STARTED

kafka.api.AuthorizerIntegrationTest > testCreatePermissionNeededForWritingToNonExistentTopic
PASSED

kafka.api.AuthorizerIntegrationTest > testSimpleConsumeWithOffsetLookupAndNoGroupAccess
STARTED

kafka.api.AuthorizerIntegrationTest > testSimpleConsumeWithOffsetLookupAndNoGroupAccess
PASSED

kafka.api.AuthorizerIntegrationTest > testConsumeWithTopicDescribe STARTED

kafka.api.AuthorizerIntegrationTest > testConsumeWithTopicDescribe PASSED

kafka.api.AuthorizerIntegrationTest > testOffsetFetchWithNoTopicAccess STARTED

kafka.api.AuthorizerIntegrationTest > testOffsetFetchWithNoTopicAccess PASSED

kafka.api.AuthorizerIntegrationTest > testCommitWithNoTopicAccess STARTED

kafka.api.AuthorizerIntegrationTest > testCommitWithNoTopicAccess PASSED

kafka.api.AuthorizerIntegrationTest > testProduceWithNoTopicAccess STARTED

kafka.api.AuthorizerIntegrationTest > testProduceWithNoTopicAccess PASSED

kafka.api.AuthorizerIntegrationTest > testProduceWithTopicWrite STARTED

kafka.api.AuthorizerIntegrationTest > testProduceWithTopicWrite PASSED

kafka.api.AuthorizerIntegrationTest > testAuthorization STARTED

kafka.api.AuthorizerIntegrationTest > testAuthorization PASSED

kafka.api.AuthorizerIntegrationTest > testUnauthorizedDeleteWithDescribe STARTED

kafka.api.AuthorizerIntegrationTest > testUnauthorizedDeleteWithDescribe PASSED

kafka.api.AuthorizerIntegrationTest > testConsumeWithTopicAndGroupRead STARTED

kafka.api.AuthorizerIntegrationTest > testConsumeWithTopicAndGroupRead PASSED

kafka.api.AuthorizerIntegrationTest > testUnauthorizedDeleteWithoutDescribe STARTED

kafka.api.AuthorizerIntegrationTest > testUnauthorizedDeleteWithoutDescribe PASSED

kafka.api.AuthorizerIntegrationTest > testConsumeWithTopicWrite STARTED

kafka.api.AuthorizerIntegrationTest > testConsumeWithTopicWrite PASSED

kafka.api.AuthorizerIntegrationTest > testOffsetFetchWithNoGroupAccess STARTED

kafka.api.AuthorizerIntegrationTest > testOffsetFetchWithNoGroupAccess PASSED

kafka.api.AuthorizerIntegrationTest > testCommitWithNoAccess STARTED

kafka.api.AuthorizerIntegrationTest > testCommitWithNoAccess PASSED

kafka.api.AuthorizerIntegrationTest > testCommitWithNoGroupAccess STARTED

kafka.api.AuthorizerIntegrationTest > testCommitWithNoGroupAccess PASSED

kafka.api.AuthorizerIntegrationTest > testConsumeWithNoAccess STARTED

kafka.api.AuthorizerIntegrationTest > testConsumeWithNoAccess PASSED

kafka.api.AuthorizerIntegrationTest > testOffsetFetchWithTopicAndGroupRead STARTED

kafka.api.AuthorizerIntegrationTest > testOffsetFetchWithTopicAndGroupRead PASSED

kafka.api.AuthorizerIntegrationTest > testCommitWithTopicDescribe STARTED

kafka.api.AuthorizerIntegrationTest > testCommitWithTopicDescribe PASSED

kafka.api.AuthorizerIntegrationTest > testProduceWithTopicDescribe STARTED

kafka.api.AuthorizerIntegrationTest > testProduceWithTopicDescribe PASSED

kafka.api.AuthorizerIntegrationTest > testOffsetFetchTopicDescribe STARTED

kafka.api.AuthorizerIntegrationTest > testOffsetFetchTopicDescribe PASSED

kafka.api.AuthorizerIntegrationTest > testCommitWithTopicAndGroupRead STARTED

kafka.api.AuthorizerIntegrationTest > testCommitWithTopicAndGroupRead PASSED

kafka.api.AuthorizerIntegrationTest > testSimpleConsumeWithExplicitSeekAndNoGroupAccess
STARTED

kafka.api.AuthorizerIntegrationTest > testSimpleConsumeWithExplicitSeekAndNoGroupAccess
PASSED

kafka.api.SaslPlainPlaintextConsumerTest > testCoordinatorFailover STARTED

kafka.api.SaslPlainPlaintextConsumerTest > testCoordinatorFailover PASSED

kafka.api.SaslPlainPlaintextConsumerTest > testSimpleConsumption STARTED

kafka.api.SaslPlainPlaintextConsumerTest > testSimpleConsumption PASSED

kafka.api.RequestResponseSerializationTest > testSerializationAndDeserialization STARTED

kafka.api.RequestResponseSerializationTest > testSerializationAndDeserialization PASSED

kafka.api.RequestResponseSerializationTest > testFetchResponseVersion STARTED

kafka.api.RequestResponseSerializationTest > testFetchResponseVersion PASSED

kafka.api.RequestResponseSerializationTest > testProduceResponseVersion STARTED

kafka.api.RequestResponseSerializationTest > testProduceResponseVersion PASSED

kafka.api.SaslPlainSslEndToEndAuthorizationTest > testNoConsumeAcl STARTED

kafka.api.SaslPlainSslEndToEndAuthorizationTest > testNoConsumeAcl PASSED

kafka.api.SaslPlainSslEndToEndAuthorizationTest > testProduceConsumeViaAssign STARTED

kafka.api.SaslPlainSslEndToEndAuthorizationTest > testProduceConsumeViaAssign PASSED

kafka.api.SaslPlainSslEndToEndAuthorizationTest > testNoProduceAcl STARTED

kafka.api.SaslPlainSslEndToEndAuthorizationTest > testNoProduceAcl PASSED

kafka.api.SaslPlainSslEndToEndAuthorizationTest > testNoGroupAcl STARTED

kafka.api.SaslPlainSslEndToEndAuthorizationTest > testNoGroupAcl PASSED

kafka.api.SaslPlainSslEndToEndAuthorizationTest > testProduceConsumeViaSubscribe STARTED

kafka.api.SaslPlainSslEndToEndAuthorizationTest > testProduceConsumeViaSubscribe PASSED

kafka.api.SaslSslConsumerTest > testCoordinatorFailover STARTED
:kafka-trunk-jdk7:core:test FAILED
:test_core_2_11 FAILED

FAILURE: Build failed with an exception.

* What went wrong:
Execution failed for task ':core:test'.
> Process 'Gradle Test Executor 2' finished with non-zero exit value 1

* Try:
Run with --stacktrace option to get the stack trace. Run with --info or --debug option to
get more log output.

BUILD FAILED

Total time: 2 hrs 20 mins 57.14 secs
Build step 'Execute shell' marked build as failure
Recording test results
Setting GRADLE_2_4_RC_2_HOME=/home/jenkins/jenkins-slave/tools/hudson.plugins.gradle.GradleInstallation/Gradle_2.4-rc-2
Setting GRADLE_2_4_RC_2_HOME=/home/jenkins/jenkins-slave/tools/hudson.plugins.gradle.GradleInstallation/Gradle_2.4-rc-2

Mime
View raw message